{"text_format":"1","workbook":"xlsx","n_sheets":9,"sheets":["Team Performance","Dashboard","Sales Dashboard","Sum Over Time","Sums","Financial Dashboard","Human Resources","Stock Performance","Lkup"],"not_rendered":{"charts":3,"images":1,"macros":1,"external_links":0,"defined_names":23,"comments":0,"pivot_tables":0},"unopened":[],"bounds":{"document_bytes":16777216,"sheet_cells":100000,"rows_first":2000,"rows_last":500,"rows_between":2000,"halvings":0,"cell_chars":16384,"cell_head_chars":4096},"cells_cut":0,"cells_raw":0,"read":"whole","date_system":"1900"}

{"sheet":"Team Performance","index":0,"n_rows":103,"n_cols":19,"rows_kept":103,"cut":false,"hidden":true,"merged":[]}
["Team","Team Members","Product","Sale Date","Region","Login Hours","Total Talk Time","Total Hold Time","Sales","Sales Per Hour","Revenue","Revenue Per Hour","Calls","Excellent","Good","Fair","Poor","Total","CSAT% (Customer Satisfaction)"]
["Team A","Sydnee","Product 1","2014-06-01","Alabama",7,6,0.5,22,3.1428571428571428,748,106.85714285714286,358,24,40,32,15,{"$f":"SUM(M2:Q2)","v":469},{"$f":"SUM(N2:O2)/R2","v":0.13646055437100213}]
["Team A","Amber","Product 2","2014-06-01","California",7.5,6.5,0.70000000000000018,19,2.5333333333333332,646,86.13333333333334,323,20,35,34,15,{"$f":"SUM(M3:Q3)","v":427},{"$f":"SUM(N3:O3)/R3","v":0.1288056206088993}]
["Team A","Constance","Product 1","2014-06-01","Colorado",8,7,0.3,16,2,544,68,310,29,32,30,11,412,0.14805825242718446]
["Team A","Nola","Product 2","2014-06-01","Connecticut",8.3000000000000007,7.3000000000000007,0.8,21,2.5301204819277108,714,86.024096385542165,327,25,36,33,12,433,0.14087759815242495]
["Team A","Libby","Product 1","2014-06-01","Florida",7.3,6.3,0.2,23,3.1506849315068495,782,107.12328767123287,367,27,37,36,12,479,0.1336116910229645]
["Team A","Tashya","Product 2","2014-06-01","Hawaii",7.9,6.9,0.6,24,3.0379746835443036,816,103.29113924050633,379,23,37,33,11,483,0.12422360248447205]
["Team A","Flavia","Product 1","2014-06-01","Alabama",7.6,6.6,0.5,15,1.9736842105263159,510,67.10526315789474,302,24,37,33,12,408,0.14950980392156862]
["Team A","Guinevere","Product 2","2014-06-01","California",7,6,0.70000000000000018,19,2.7142857142857144,646,92.285714285714292,380,21,32,33,11,477,0.1111111111111111]
["Team A","Darryl","Product 1","2014-06-01","Colorado",7.5,6.5,0.3,20,2.6666666666666665,680,90.666666666666671,394,30,38,35,13,510,0.13333333333333333]
["Team A","Farrah","Product 2","2014-06-01","Connecticut",8,7,0.8,24,3,816,102,321,27,32,40,14,434,0.13594470046082949]
["Team B","Rowan","Product 1","2014-06-01","Florida",8.3000000000000007,7.3000000000000007,0.2,25,3.012048192771084,850,102.40963855421685,348,20,38,30,10,446,0.13004484304932734]
["Team B","Quyn","Product 2","2014-06-01","Hawaii",7.3,6.3,0.6,21,2.8767123287671232,714,97.808219178082197,381,23,34,36,11,485,0.11752577319587629]
["Team B","Xantha","Product 1","2014-06-01","Alabama",7.9,6.9,0.5,24,3.0379746835443036,816,103.29113924050633,335,28,31,33,15,442,0.1334841628959276]
["Team B","Winifred","Product 2","2014-06-01","California",7.6,6.6,0.70000000000000018,18,2.3684210526315792,612,80.526315789473685,327,23,30,33,11,424,0.125]
["Team B","Iona","Product 1","2014-06-01","Colorado",7,6,0.3,23,3.2857142857142856,782,111.71428571428571,369,21,40,34,10,474,0.12869198312236288]
["Team B","Keelie","Product 2","2014-06-01","Connecticut",7.5,6.5,0.8,24,3.2,816,108.8,365,29,34,36,14,478,0.13179916317991633]
["Team B","Brynne","Product 1","2014-06-01","Florida",8,7,0.2,19,2.375,646,80.75,370,27,38,33,14,482,0.13485477178423236]
["Team B","Sierra","Product 2","2014-06-01","Hawaii",8.3000000000000007,7.3000000000000007,0.6,15,1.8072289156626504,510,61.445783132530117,302,21,34,36,13,406,0.1354679802955665]
["Team B","Gay","Product 1","2014-06-01","Alabama",7.3,6.3,0.5,18,2.4657534246575343,612,83.835616438356169,316,28,33,34,11,422,0.14454976303317535]
["Team B","Inez","Product 2","2014-06-01","California",7.9,6.9,0.70000000000000018,25,3.1645569620253164,850,107.59493670886076,330,24,32,30,10,426,0.13145539906103287]
["Team C","Illana","Product 1","2014-06-01","Colorado",7.6,6.6,0.3,15,1.9736842105263159,510,67.10526315789474,356,21,35,35,10,457,0.12253829321663019]
["Team C","Renee","Product 2","2014-06-01","Connecticut",7,6,0.8,23,3.2857142857142856,782,111.71428571428571,397,23,32,33,13,498,0.11044176706827309]
["Team C","Olympia","Product 1","2014-06-01","Florida",7.5,6.5,0.2,24,3.2,816,108.8,379,20,36,31,14,480,0.11666666666666667]
["Team C","Camille","Product 2","2014-06-01","Hawaii",8,7,0.6,21,2.625,714,89.25,348,22,30,37,14,451,0.11529933481152993]
["Team C","Shaine","Product 1","2014-06-01","Alabama",8.3000000000000007,7.3000000000000007,0.5,19,2.2891566265060237,646,77.831325301204814,356,28,38,40,14,476,0.13865546218487396]
["Team C","Maris","Product 2","2014-06-01","California",7.3,6.3,0.70000000000000018,19,2.6027397260273974,646,88.493150684931507,354,28,38,36,11,467,0.14132762312633834]
["Team C","Jana","Product 1","2014-06-01","Colorado",7.9,6.9,0.3,22,2.7848101265822782,748,94.683544303797461,341,22,30,31,14,438,0.11872146118721461]
["Team C","Audra","Product 2","2014-06-01","Connecticut",7.6,6.6,0.8,16,2.1052631578947367,544,71.578947368421055,376,28,39,33,12,488,0.13729508196721313]
["Team C","Rosalyn","Product 1","2014-06-01","Florida",7,6,0.2,16,2.2857142857142856,544,77.714285714285708,353,27,37,35,12,464,0.13793103448275862]
["Team C","April","Product 2","2014-06-01","Hawaii",7.5,6.5,0.6,15,2,510,68,324,25,32,31,14,426,0.13380281690140844]
["Team D","Dara","Product 1","2014-06-01","Alabama",8,7,0.5,18,2.25,612,76.5,364,21,32,37,13,467,0.11349036402569593]
["Team D","Daria","Product 2","2014-06-01","California",8.3000000000000007,7.3000000000000007,0.70000000000000018,20,2.4096385542168672,680,81.92771084337349,357,24,30,39,11,461,0.11713665943600868]
["Team D","Ariel","Product 1","2014-06-01","Colorado",7.3,6.3,0.3,15,2.0547945205479454,510,69.863013698630141,301,27,39,39,11,417,0.15827338129496402]
["Team D","Hermione","Product 2","2014-06-01","Connecticut",7.9,6.9,0.8,16,2.0253164556962022,544,68.860759493670884,398,29,31,33,11,502,0.11952191235059761]
["Team D","Aileen","Product 1","2014-06-01","Florida",7.6,6.6,0.2,19,2.5,646,85,324,22,36,39,14,435,0.13333333333333333]
["Team D","Cheyenne","Product 2","2014-06-01","Hawaii",7,6,0.6,19,2.7142857142857144,646,92.285714285714292,307,24,33,40,11,415,0.13734939759036144]
["Team D","Lois","Product 1","2014-06-01","Alabama",7.5,6.5,0.5,16,2.1333333333333333,544,72.533333333333331,327,28,33,37,12,437,0.13958810068649885]
["Team D","Madeson","Product 2","2014-06-01","California",8,7,0.70000000000000018,16,2,544,68,394,29,37,34,11,505,0.1306930693069307]
["Team D","Ariana","Product 1","2014-06-01","Colorado",8.3000000000000007,7.3000000000000007,0.3,24,2.8915662650602405,816,98.313253012048179,369,21,40,34,15,479,0.12734864300626306]
["Team D","Kendall","Product 2","2014-06-01","Connecticut",7.3,6.3,0.8,24,3.2876712328767126,816,111.78082191780823,338,28,35,39,15,455,0.13846153846153847]
["Team E","Lacy","Product 1","2014-06-01","Florida",7.9,6.9,0.2,22,2.7848101265822782,748,94.683544303797461,377,27,30,34,10,478,0.1192468619246862]
["Team E","Heather","Product 2","2014-06-01","Hawaii",7.6,6.6,0.6,17,2.236842105263158,578,76.05263157894737,398,28,31,32,10,499,0.11823647294589178]
["Team E","Nevada","Product 1","2014-06-01","Alabama",8.3000000000000007,7.3000000000000007,0.5,23,2.7710843373493974,782,94.216867469879503,320,23,30,39,12,424,0.125]
["Team E","Mercedes","Product 2","2014-06-01","California",7.3,6.3,0.70000000000000018,25,3.4246575342465753,850,116.43835616438356,338,24,34,33,12,441,0.13151927437641722]
["Team E","Courtney","Product 1","2014-06-01","Colorado",7.9,6.9,0.3,23,2.9113924050632911,782,98.987341772151893,371,29,30,38,12,480,0.12291666666666666]
["Team E","Amanda","Product 2","2014-06-01","Connecticut",7.6,6.6,0.8,17,2.236842105263158,578,76.05263157894737,347,20,40,35,15,457,0.13129102844638948]
["Team E","Madeline","Product 1","2014-06-01","Florida",7,6,0.2,23,3.2857142857142856,782,111.71428571428571,368,30,40,38,15,491,0.1425661914460285]
["Team E","Zia","Product 2","2014-06-01","Hawaii",7.5,6.5,0.6,25,3.3333333333333335,850,113.33333333333333,353,22,31,37,13,456,0.1162280701754386]
["Team E","Miriam","Product 1","2014-06-01","Alabama",8,7,0.5,24,3,816,102,339,30,40,30,11,450,0.15555555555555556]
["Team E","Quin","Product 2","2014-06-01","California",8.3000000000000007,7.3000000000000007,0.70000000000000018,16,1.9277108433734937,544,65.542168674698786,395,23,35,37,12,502,0.11553784860557768]
["Team F","Ivory","Product 1","2014-06-01","Colorado",7.3,6.3,0.3,19,2.6027397260273974,646,88.493150684931507,316,30,40,36,15,437,0.16018306636155608]
["Team F","Stacy","Product 2","2014-06-01","Connecticut",7.9,6.9,0.8,25,3.1645569620253164,850,107.59493670886076,383,30,30,36,10,489,0.12269938650306748]
["Team F","Dai","Product 1","2014-06-01","Florida",7.6,6.6,0.2,16,2.1052631578947367,544,71.578947368421055,336,23,38,35,10,442,0.13800904977375567]
["Team F","Shelley","Product 2","2014-06-01","Hawaii",7,6,0.6,20,2.8571428571428572,680,97.142857142857139,333,20,31,34,13,431,0.11832946635730858]
["Team F","Shelby","Product 1","2014-06-01","Alabama",7.5,6.5,0.5,22,2.9333333333333331,748,99.733333333333334,389,20,39,39,13,500,0.11799999999999999]
["Team F","Riley","Product 2","2014-06-01","California",8,7,0.70000000000000018,23,2.875,782,97.75,334,30,38,30,11,443,0.15349887133182843]
["Team F","Cleo","Product 1","2014-06-01","Colorado",8.3000000000000007,7.3000000000000007,0.3,20,2.4096385542168672,680,81.92771084337349,307,28,33,32,12,412,0.14805825242718446]
["Team F","Patricia","Product 2","2014-06-01","Connecticut",7.3,6.3,0.8,19,2.6027397260273974,646,88.493150684931507,378,24,35,37,13,487,0.12114989733059549]
["Team F","Britanney","Product 1","2014-06-01","Florida",7.9,6.9,0.2,15,1.8987341772151898,510,64.556962025316452,357,27,30,31,12,457,0.12472647702407003]
["Team F","Tatum","Product 2","2014-06-01","Hawaii",7.6,6.6,0.6,18,2.3684210526315792,612,80.526315789473685,370,22,33,32,15,472,0.11652542372881355]
["Team G","Katelyn","Product 1","2014-06-01","Alabama",7,6,0.5,21,3,714,102,322,24,30,32,14,422,0.12796208530805686]
["Team G","Pamela","Product 2","2014-06-01","California",7.5,6.5,0.70000000000000018,22,2.9333333333333331,748,99.733333333333334,326,29,33,38,13,439,0.14123006833712984]
["Team G","Rhoda","Product 1","2014-06-01","Colorado",8,7,0.3,21,2.625,714,89.25,339,25,32,31,14,441,0.12925170068027211]
["Team G","Deanna","Product 2","2014-06-01","Connecticut",8.3000000000000007,7.3000000000000007,0.8,20,2.4096385542168672,680,81.92771084337349,390,21,33,35,13,492,0.10975609756097561]
["Team G","Mallory","Product 1","2014-06-01","Florida",7.3,6.3,0.2,19,2.6027397260273974,646,88.493150684931507,330,30,33,40,13,446,0.14125560538116591]
["Team G","Medge","Product 2","2014-06-01","Hawaii",7.9,6.9,0.6,15,1.8987341772151898,510,64.556962025316452,392,27,30,30,12,{"$f":"SUM(M67:Q67)","v":491},{"$f":"SUM(N67:O67)/R67","v":0.11608961303462322}]
["Team G","Dana","Product 1","2014-06-01","Alabama",7.6,6.6,0.5,22,2.8947368421052633,748,98.421052631578945,396,27,30,38,15,506,0.11264822134387352]
["Team G","Regina","Product 2","2014-06-01","California",7,6,0.70000000000000018,20,2.8571428571428572,680,97.142857142857139,372,21,39,35,13,480,0.125]
["Team G","Kirby","Product 1","2014-06-01","Colorado",7.5,6.5,0.3,16,2.1333333333333333,544,72.533333333333331,352,23,39,32,14,460,0.13478260869565217]
["Team G","Rae","Product 2","2014-06-01","Connecticut",8,7,0.8,25,3.125,850,106.25,373,28,31,40,10,482,0.12240663900414937]
["Team H","Frances","Product 1","2014-06-01","Florida",8.3000000000000007,7.3000000000000007,0.2,16,1.9277108433734937,544,65.542168674698786,394,27,37,37,10,505,0.12673267326732673]
["Team H","Xerxes","Product 2","2014-06-01","Hawaii",7.3,6.3,0.6,24,3.2876712328767126,816,111.78082191780823,303,29,38,32,13,415,0.16144578313253011]
["Team H","Carolyn","Product 1","2014-06-01","Alabama",7.9,6.9,0.5,23,2.9113924050632911,782,98.987341772151893,382,23,33,33,11,482,0.11618257261410789]
["Team H","Zenia","Product 2","2014-06-01","California",7.6,6.6,0.70000000000000018,21,2.763157894736842,714,93.94736842105263,316,28,36,35,11,426,0.15023474178403756]
["Team H","Phyllis","Product 1","2014-06-01","Colorado",7,6,0.3,17,2.4285714285714284,578,82.571428571428569,334,29,31,30,11,435,0.13793103448275862]
["Team H","Ashely","Product 2","2014-06-01","Connecticut",7.5,6.5,0.8,21,2.8,714,95.2,391,27,31,35,13,497,0.11670020120724346]
["Team H","Nomlanga","Product 1","2014-06-01","Florida",8,7,0.2,23,2.875,782,97.75,368,26,31,38,11,474,0.12025316455696203]
["Team H","Kirestin","Product 2","2014-06-01","Hawaii",8.3000000000000007,7.3000000000000007,0.6,16,1.9277108433734937,544,65.542168674698786,376,25,36,33,11,481,0.12681912681912683]
["Team H","Serena","Product 1","2014-06-01","Alabama",7.3,6.3,0.5,15,2.0547945205479454,510,69.863013698630141,359,25,37,34,10,465,0.13333333333333333]
["Team H","Hilary","Product 2","2014-06-01","California",7.9,6.9,0.70000000000000018,19,2.4050632911392404,646,81.77215189873418,302,28,32,34,15,411,0.145985401459854]
["Team I","Gretchen","Product 1","2014-06-01","Colorado",7.6,6.6,0.3,17,2.236842105263158,578,76.05263157894737,323,27,38,36,11,435,0.14942528735632185]
["Team I","Giselle","Product 2","2014-06-01","Connecticut",7,6,0.8,16,2.2857142857142856,544,77.714285714285708,400,30,32,38,15,515,0.12038834951456311]
["Team I","Galena","Product 1","2014-06-01","Florida",7.5,6.5,0.2,17,2.2666666666666666,578,77.066666666666663,397,29,31,32,10,499,0.12024048096192384]
["Team I","Calista","Product 2","2014-06-01","Hawaii",8,7,0.6,15,1.875,510,63.75,327,27,33,37,13,437,0.13729977116704806]
["Team I","Juliet","Product 1","2014-06-01","Alabama",8.3000000000000007,7.3000000000000007,0.5,24,2.8915662650602405,816,98.313253012048179,327,20,34,32,10,423,0.1276595744680851]
["Team I","Karyn","Product 2","2014-06-01","California",7.3,6.3,0.70000000000000018,19,2.6027397260273974,646,88.493150684931507,317,25,32,38,13,425,0.13411764705882354]
["Team I","Noelani","Product 1","2014-06-01","Colorado",7.9,6.9,0.3,16,2.0253164556962022,544,68.860759493670884,365,30,35,33,14,477,0.13626834381551362]
["Team I","Portia","Product 2","2014-06-01","Connecticut",7.6,6.6,0.8,16,2.1052631578947367,544,71.578947368421055,396,25,39,37,11,508,0.12598425196850394]
["Team I","Melodie","Product 1","2014-06-01","Florida",7,6,0.2,23,3.2857142857142856,782,111.71428571428571,319,27,38,40,13,437,0.14874141876430205]
["Team I","Yolanda","Product 2","2014-06-01","Hawaii",7.5,6.5,0.6,21,2.8,714,95.2,329,24,32,33,14,432,0.12962962962962962]
["Team I","Serina","Product 1","2014-06-01","Alabama",8,7,0.5,25,3.125,850,106.25,333,29,34,35,12,443,0.14221218961625282]
["Team J","Jena","Product 2","2014-06-01","California",8.3000000000000007,7.3000000000000007,0.70000000000000018,22,2.6506024096385539,748,90.120481927710841,386,20,39,38,12,495,0.1191919191919192]
["Team J","Fleur","Product 1","2014-06-01","Colorado",7.3,6.3,0.3,24,3.2876712328767126,816,111.78082191780823,329,26,36,39,10,440,0.1409090909090909]
["Team J","Illiana","Product 2","2014-06-01","Connecticut",7.9,6.9,0.8,22,2.7848101265822782,748,94.683544303797461,332,22,39,32,11,436,0.13990825688073394]
["Team J","Jeremy","Product 1","2014-06-01","Florida",7.6,6.6,0.2,15,1.9736842105263159,510,67.10526315789474,384,21,37,39,11,492,0.11788617886178862]
["Team J","Oscar","Product 2","2014-06-01","Hawaii",7,6,0.6,17,2.4285714285714284,578,82.571428571428569,327,21,38,36,12,434,0.13594470046082949]
["Team J","Luke","Product 1","2014-06-01","Alabama",7.5,6.5,0.5,20,2.6666666666666665,680,90.666666666666671,396,24,39,31,10,500,0.126]
["Team J","Addison","Product 2","2014-06-01","California",8,7,0.70000000000000018,18,2.25,612,76.5,350,29,30,32,12,453,0.13024282560706402]
["Team J","Alec","Product 1","2014-06-01","Colorado",8.3000000000000007,7.3000000000000007,0.3,21,2.5301204819277108,714,86.024096385542165,300,23,39,34,14,410,0.15121951219512195]
["Team J","Rafael","Product 2","2014-06-01","Connecticut",7.3,6.3,0.8,15,2.0547945205479454,510,69.863013698630141,316,29,35,33,10,423,0.15130023640661938]
["Team J","Hoyt","Product 1","2014-06-01","Florida",7.6,6.6,0.2,15,1.9736842105263159,510,67.10526315789474,384,21,37,39,11,492,0.11788617886178862]
["Team J","Abel","Product 2","2014-06-01","Hawaii",7,6,0.6,17,2.4285714285714284,578,82.571428571428569,327,21,38,36,12,434,0.13594470046082949]

{"sheet":"Dashboard","index":1,"n_rows":24,"n_cols":10,"rows_kept":24,"cut":false,"hidden":false,"merged":[[23,9,23,10],[0,0,0,11],[16,0,16,1]]}
["Cobrahouse Computers, Inc.\n2011/2012 Sales Dashboard"]
["Total Sales","by Customer Type"]
[{"$f":"MID(B2,4,25)","v":"Customer Type"},"Total Sales"]
["Full-time Employee",237110]
["Maintstream Youth",236950]
["NPO/NGO",235282]
["Military",235131]
["Post Graduate Student",234674]
["Full-time Parent",229290]
["Self-Employed",225617]
["Corporation",225552]
["Government",225304]
["College Student",224129]
["Retired",220798]
["Business Owner",218346]
[]
["Quarterly Sales by Product",null,"All Regions"]
[]
[]
[]
[]
[]
[]
[null,null,null,null,null,null,null,null,null,"USA Regions"]

{"sheet":"Sales Dashboard","index":2,"n_rows":146,"n_cols":40,"rows_kept":146,"cut":false,"hidden":false,"merged":[[0,4,0,27],[0,28,0,39]]}
[null,null,null,null,"Sales",null,null,null,null,null,null,null,null,null,null,null,null,null,null,null,null,null,null,null,null,null,null,null,"Additional Columns"]
["Region","Product","Customer Type0","Sales Person - Name","2011-01-01","2011-02-01","2011-03-01","2011-04-01","2011-05-01","2011-06-01","2011-07-01","2011-08-01","2011-09-01","2011-10-01","2011-11-01","2011-12-01","2012-01-01","2012-02-01","2012-03-01","2012-04-01","2012-05-01","2012-06-01","2012-07-01","2012-08-01","2012-09-01","2012-10-01","2012-11-01","2012-12-01","Total","Product Name","Customer Type","Salesperson","Q1 2011","Q2 2011","Q3 2011","Q4 2011","Q1 2012","Q2 2012","Q3 2012","Q4 2012"]
["Region 1","Product 1","Customer 1","Person 1",717,641,654,752,595,769,793,710,564,677,619,723,639,757,746,758,562,563,782,559,640,669,774,692,{"$f":"SUM(E3:AB3)","v":16355},{"$f":"VLOOKUP(B3,Lkup!$A$2:$B$100,2,FALSE)","v":"Touchscreen Laptop"},{"$f":"VLOOKUP(C3,Lkup!$A$2:$B$100,2,FALSE)","v":"College Student"},{"$f":"VLOOKUP(D3,Lkup!$A$2:$B$100,2,FALSE)","v":"Bo Kornegay"},{"$f":"SUM(E3:G3)","v":2012},{"$f":"SUM(H3:J3)","v":2116},{"$f":"SUM(K3:M3)","v":2067},{"$f":"SUM(N3:P3)","v":2019},{"$f":"SUM(Q3:S3)","v":2142},{"$f":"SUM(T3:V3)","v":1883},{"$f":"SUM(W3:Y3)","v":1981},{"$f":"SUM(Z3:AB3)","v":2135}]
["Region 1","Product 1","Customer 2","Person 2",1400,1220,1114,899,1351,835,873,909,888,1278,1350,1348,931,1298,1164,800,903,958,836,909,853,918,1223,886,{"$f":"SUM(E4:AB4)","v":25144},{"$f":"VLOOKUP(B4,Lkup!$A$2:$B$100,2,FALSE)","v":"Touchscreen Laptop"},{"$f":"VLOOKUP(C4,Lkup!$A$2:$B$100,2,FALSE)","v":"Post Graduate Student"},{"$f":"VLOOKUP(D4,Lkup!$A$2:$B$100,2,FALSE)","v":"Britta Blakley"},{"$f":"SUM(E4:G4)","v":3734},{"$f":"SUM(H4:J4)","v":3085},{"$f":"SUM(K4:M4)","v":2670},{"$f":"SUM(N4:P4)","v":3976},{"$f":"SUM(Q4:S4)","v":3393},{"$f":"SUM(T4:V4)","v":2661},{"$f":"SUM(W4:Y4)","v":2598},{"$f":"SUM(Z4:AB4)","v":3027}]
["Region 1","Product 1","Customer 3","Person 3",696,643,644,596,645,649,612,675,794,591,709,561,733,771,792,577,586,727,678,753,652,689,767,643,16183,{"$f":"VLOOKUP(B5,Lkup!$A$2:$B$100,2,FALSE)","v":"Touchscreen Laptop"},{"$f":"VLOOKUP(C5,Lkup!$A$2:$B$100,2,FALSE)","v":"Full-time Parent"},{"$f":"VLOOKUP(D5,Lkup!$A$2:$B$100,2,FALSE)","v":"Brock Stalder"},1983,1890,2081,1861,2296,1890,2083,2099]
["Region 1","Product 1","Customer 4","Person 4",732,628,628,667,819,640,850,755,612,644,622,881,854,766,713,784,667,711,733,677,637,815,756,693,17284,{"$f":"VLOOKUP(B6,Lkup!$A$2:$B$100,2,FALSE)","v":"Touchscreen Laptop"},{"$f":"VLOOKUP(C6,Lkup!$A$2:$B$100,2,FALSE)","v":"Self-Employed"},{"$f":"VLOOKUP(D6,Lkup!$A$2:$B$100,2,FALSE)","v":"Catherine Shoaff"},1988,2126,2217,2147,2333,2162,2047,2264]
["Region 1","Product 1","Customer 5","Person 5",607,602,636,869,847,806,895,835,843,799,834,785,744,858,799,677,867,605,828,620,655,704,784,635,18134,{"$f":"VLOOKUP(B7,Lkup!$A$2:$B$100,2,FALSE)","v":"Touchscreen Laptop"},{"$f":"VLOOKUP(C7,Lkup!$A$2:$B$100,2,FALSE)","v":"Full-time Employee"},{"$f":"VLOOKUP(D7,Lkup!$A$2:$B$100,2,FALSE)","v":"Fermin Quin"},1845,2522,2573,2418,2401,2149,2103,2123]
["Region 1","Product 1","Customer 6","Person 6",800,607,737,621,660,733,743,666,630,644,617,695,653,648,788,731,710,745,788,756,627,669,731,650,16649,{"$f":"VLOOKUP(B8,Lkup!$A$2:$B$100,2,FALSE)","v":"Touchscreen Laptop"},{"$f":"VLOOKUP(C8,Lkup!$A$2:$B$100,2,FALSE)","v":"Business Owner"},{"$f":"VLOOKUP(D8,Lkup!$A$2:$B$100,2,FALSE)","v":"Glenda Harbaugh"},2144,2014,2039,1956,2089,2186,2171,2050]
["Region 1","Product 1","Customer 7","Person 7",1064,863,1316,1141,933,872,1185,1358,1173,1343,1164,1275,1364,828,1299,863,910,1146,915,941,1093,1224,938,946,26154,{"$f":"VLOOKUP(B9,Lkup!$A$2:$B$100,2,FALSE)","v":"Touchscreen Laptop"},{"$f":"VLOOKUP(C9,Lkup!$A$2:$B$100,2,FALSE)","v":"Maintstream Youth"},{"$f":"VLOOKUP(D9,Lkup!$A$2:$B$100,2,FALSE)","v":"Jarrett Rimmer"},3243,2946,3716,3782,3491,2919,2949,3108]
["Region 1","Product 1","Customer 8","Person 8",667,609,780,559,673,727,730,550,787,609,762,604,555,747,640,649,565,725,602,594,799,721,786,589,16029,{"$f":"VLOOKUP(B10,Lkup!$A$2:$B$100,2,FALSE)","v":"Touchscreen Laptop"},{"$f":"VLOOKUP(C10,Lkup!$A$2:$B$100,2,FALSE)","v":"Retired"},{"$f":"VLOOKUP(D10,Lkup!$A$2:$B$100,2,FALSE)","v":"Li Bruni"},2056,1959,2067,1975,1942,1939,1995,2096]
["Region 1","Product 1","Customer 9","Person 9",890,751,645,807,845,820,832,771,724,696,657,899,693,705,749,758,774,652,801,815,649,638,615,896,18082,{"$f":"VLOOKUP(B11,Lkup!$A$2:$B$100,2,FALSE)","v":"Touchscreen Laptop"},{"$f":"VLOOKUP(C11,Lkup!$A$2:$B$100,2,FALSE)","v":"Government"},{"$f":"VLOOKUP(D11,Lkup!$A$2:$B$100,2,FALSE)","v":"Linwood Camargo"},2286,2472,2327,2252,2147,2184,2265,2149]
["Region 1","Product 1","Customer 10","Person 10",711,624,804,885,873,628,666,648,879,779,782,605,830,775,895,707,826,719,845,615,839,779,822,866,18402,{"$f":"VLOOKUP(B12,lookup,2,FALSE)","v":"Touchscreen Laptop"},{"$f":"VLOOKUP(C12,lookup,2,FALSE)","v":"Military"},{"$f":"VLOOKUP(D12,lookup,2,FALSE)","v":"Norene McNeece"},2139,2386,2193,2166,2500,2252,2299,2467]
["Region 1","Product 1","Customer 11","Person 11",651,788,748,703,701,692,771,738,646,608,786,737,603,604,632,680,729,756,795,772,663,768,735,683,16989,"Touchscreen Laptop","Corporation","Rick Boehm",2187,2096,2155,2131,1839,2165,2230,2186]
["Region 1","Product 1","Customer 12","Person 12",1075,1154,866,1055,990,1364,934,1193,1161,1323,1060,1058,1117,944,1004,1172,1074,1283,840,1050,1031,852,1192,1113,25905,"Touchscreen Laptop","NPO/NGO","Sueann Olivero",3095,3409,3288,3441,3065,3529,2921,3157]
["Region 1","Product 2","Customer 1","Person 1",580,682,641,761,759,787,595,654,763,591,639,722,745,685,678,641,600,690,766,783,662,592,636,711,16363,"Hybrid Laptop","College Student","Bo Kornegay",1903,2307,2012,1952,2108,1931,2211,1939]
["Region 1","Product 2","Customer 2","Person 2",756,790,609,886,656,620,668,786,755,738,742,655,793,647,653,856,687,744,874,795,881,806,772,883,18052,"Hybrid Laptop","Post Graduate Student","Britta Blakley",2155,2162,2209,2135,2093,2287,2550,2461]
["Region 1","Product 2","Customer 3","Person 3",779,659,813,800,859,844,714,764,881,693,739,753,860,872,833,833,835,870,863,896,775,867,617,702,19121,"Hybrid Laptop","Full-time Parent","Brock Stalder",2251,2503,2359,2185,2565,2538,2534,2186]
["Region 1","Product 2","Customer 4","Person 4",658,681,756,717,621,766,780,712,765,620,651,619,682,696,749,757,735,654,729,755,677,610,700,624,16714,"Hybrid Laptop","Self-Employed","Catherine Shoaff",2095,2104,2257,1890,2127,2146,2161,1934]
["Region 1","Product 2","Customer 5","Person 5",1230,817,1030,1078,1093,1172,1323,1053,1121,1301,1103,1190,1248,1007,1003,908,830,1107,800,1117,1189,1352,1084,1012,26168,"Hybrid Laptop","Full-time Employee","Fermin Quin",3077,3343,3497,3594,3258,2845,3106,3448]
["Region 1","Product 2","Customer 6","Person 6",727,586,583,673,706,610,645,556,560,646,658,592,630,576,657,574,586,600,625,568,597,698,588,596,14837,"Hybrid Laptop","Business Owner","Glenda Harbaugh",1896,1989,1761,1896,1863,1760,1790,1882]
["Region 1","Product 2","Customer 7","Person 7",642,778,843,881,726,850,827,759,721,618,757,899,632,853,824,833,880,787,760,726,637,669,844,875,18621,"Hybrid Laptop","Maintstream Youth","Jarrett Rimmer",2263,2457,2307,2274,2309,2500,2123,2388]
["Region 1","Product 2","Customer 8","Person 8",888,697,861,701,748,779,850,744,720,613,651,870,651,871,870,725,691,848,689,847,615,706,755,754,18144,"Hybrid Laptop","Retired","Li Bruni",2446,2228,2314,2134,2392,2264,2151,2215]
["Region 1","Product 2","Customer 9","Person 9",605,749,605,729,600,795,695,680,606,782,765,774,767,705,740,627,696,615,693,626,625,712,710,728,16629,"Hybrid Laptop","Government","Linwood Camargo",1959,2124,1981,2321,2212,1938,1944,2150]
["Region 1","Product 2","Customer 10","Person 10",1073,1161,905,1017,895,1224,1130,1314,1213,1254,942,903,870,1151,807,878,1325,804,905,1057,1193,1375,923,1093,25412,"Hybrid Laptop","Military","Norene McNeece",3139,3136,3657,3099,2828,3007,3155,3391]
["Region 1","Product 2","Customer 11","Person 11",689,688,737,759,581,608,576,704,789,617,743,684,617,554,638,611,614,697,721,691,771,570,704,764,16127,"Hybrid Laptop","Corporation","Rick Boehm",2114,1948,2069,2044,1809,1922,2183,2038]
["Region 1","Product 2","Customer 12","Person 12",715,636,679,832,780,711,879,660,880,737,602,735,684,721,838,806,855,872,605,675,802,662,600,721,17687,"Hybrid Laptop","NPO/NGO","Sueann Olivero",2030,2323,2419,2074,2243,2533,2082,1983]
["Region 1","Product 3","Customer 1","Person 1",637,646,671,714,744,786,784,697,636,654,760,722,889,631,744,834,670,853,830,827,650,696,631,851,17557,"Powerhouse Laptop","College Student","Bo Kornegay",1954,2244,2117,2136,2264,2357,2307,2178]
["Region 1","Product 3","Customer 2","Person 2",692,716,645,726,681,601,733,627,783,614,602,705,756,746,623,682,780,672,679,624,751,727,779,761,16705,"Powerhouse Laptop","Post Graduate Student","Britta Blakley",2053,2008,2143,1921,2125,2134,2054,2267]
["Region 1","Product 3","Customer 3","Person 3",1284,1302,1316,1210,823,1206,1253,1043,1223,1400,1094,881,1006,1045,1173,1102,1065,1363,1132,1212,1196,1189,962,1359,27839,"Powerhouse Laptop","Full-time Parent","Brock Stalder",3902,3239,3519,3375,3224,3530,3540,3510]
["Region 1","Product 3","Customer 4","Person 4",660,750,649,652,738,694,756,551,768,647,725,780,608,673,752,698,642,671,575,633,704,652,717,775,16470,"Powerhouse Laptop","Self-Employed","Catherine Shoaff",2059,2084,2075,2152,2033,2011,1912,2144]
["Region 1","Product 3","Customer 5","Person 5",880,775,830,713,825,722,779,768,715,708,664,609,822,630,652,732,733,849,880,848,850,788,768,612,18152,"Powerhouse Laptop","Full-time Employee","Fermin Quin",2485,2260,2262,1981,2104,2314,2578,2168]
["Region 1","Product 3","Customer 6","Person 6",804,646,608,674,698,850,617,751,655,656,673,877,608,794,631,743,843,800,705,860,686,896,663,779,17517,"Powerhouse Laptop","Business Owner","Glenda Harbaugh",2058,2222,2023,2206,2033,2386,2251,2338]
["Region 1","Product 3","Customer 7","Person 7",712,663,689,778,603,785,600,776,714,785,681,762,634,720,780,789,644,606,683,708,718,773,600,777,16980,"Powerhouse Laptop","Maintstream Youth","Jarrett Rimmer",2064,2166,2090,2228,2134,2039,2109,2150]
["Region 1","Product 3","Customer 8","Person 8",826,1022,1238,993,1219,1107,965,867,1205,872,892,944,1281,993,1254,1366,834,883,898,1255,1114,1137,900,1291,25356,"Powerhouse Laptop","Retired","Li Bruni",3086,3319,3037,2708,3528,3083,3267,3328]
["Region 1","Product 3","Customer 9","Person 9",786,614,706,763,695,648,728,578,680,573,701,645,795,763,674,628,559,702,685,663,550,708,680,776,16300,"Powerhouse Laptop","Government","Linwood Camargo",2106,2106,1986,1919,2232,1889,1898,2164]
["Region 1","Product 3","Customer 10","Person 10",800,674,757,825,779,751,693,608,675,705,892,653,608,619,814,823,759,740,873,731,796,866,773,878,18092,"Powerhouse Laptop","Military","Norene McNeece",2231,2355,1976,2250,2041,2322,2400,2517]
["Region 1","Product 3","Customer 11","Person 11",754,664,667,787,894,740,803,883,755,708,612,730,832,674,771,704,867,791,747,695,704,671,874,829,18156,"Powerhouse Laptop","Corporation","Rick Boehm",2085,2421,2441,2050,2277,2362,2146,2374]
["Region 1","Product 3","Customer 12","Person 12",782,660,631,685,646,605,701,709,699,725,725,753,665,645,698,682,779,757,773,778,726,652,776,724,16976,"Powerhouse Laptop","NPO/NGO","Sueann Olivero",2073,1936,2109,2203,2008,2218,2277,2152]
["Region 2","Product 4","Customer 1","Person 1",1194,1397,1397,1064,1211,1183,827,1088,1394,1076,1106,1372,1107,871,910,1305,1054,1122,1314,1360,801,1275,1316,918,27662,"Thin Laptop","College Student","Bo Kornegay",3988,3458,3309,3554,2888,3481,3475,3509]
["Region 2","Product 4","Customer 2","Person 2",733,607,647,786,719,775,567,620,577,671,689,762,609,780,753,590,696,695,581,739,564,598,634,689,16081,"Thin Laptop","Post Graduate Student","Britta Blakley",1987,2280,1764,2122,2142,1981,1884,1921]
["Region 2","Product 4","Customer 3","Person 3",666,815,820,862,847,752,657,620,869,848,848,886,831,712,632,883,786,821,631,615,712,870,785,794,18562,"Thin Laptop","Full-time Parent","Brock Stalder",2301,2461,2146,2582,2175,2490,1958,2449]
["Region 2","Product 4","Customer 4","Person 4",746,702,886,608,748,652,755,807,607,810,778,684,756,759,673,638,795,785,601,755,699,715,618,829,17406,"Thin Laptop","Self-Employed","Catherine Shoaff",2334,2008,2169,2272,2188,2218,2055,2162]
["Region 2","Product 4","Customer 5","Person 5",753,690,646,653,795,736,667,668,733,674,620,778,757,738,661,721,639,601,732,621,668,764,742,761,16818,"Thin Laptop","Full-time Employee","Fermin Quin",2089,2184,2068,2072,2156,1961,2021,2267]
["Region 2","Product 4","Customer 6","Person 6",1271,1188,1090,856,840,1217,933,1296,976,971,869,896,1323,1247,1081,985,1091,951,1175,1299,1254,857,1360,1386,26412,{"$f":"VLOOKUP(B44,lookup,2,FALSE)","v":"Thin Laptop"},{"$f":"VLOOKUP(C44,lookup,2,FALSE)","v":"Business Owner"},{"$f":"VLOOKUP(D44,lookup,2,FALSE)","v":"Glenda Harbaugh"},3549,2913,3205,2736,3651,3027,3728,3603]
["Region 2","Product 4","Customer 7","Person 7",797,641,785,621,709,657,570,565,560,759,573,741,728,717,689,634,756,563,626,748,792,673,679,787,16370,"Thin Laptop","Maintstream Youth","Jarrett Rimmer",2223,1987,1695,2073,2134,1953,2166,2139]
["Region 2","Product 4","Customer 8","Person 8",686,637,731,863,821,678,833,840,748,838,618,822,625,820,865,616,606,793,626,726,664,603,794,657,17510,"Thin Laptop","Retired","Li Bruni",2054,2362,2421,2278,2310,2015,2016,2054]
["Region 2","Product 4","Customer 9","Person 9",618,782,753,691,642,833,633,829,656,758,626,874,778,884,739,833,665,766,614,619,843,614,600,875,17525,"Thin Laptop","Government","Linwood Camargo",2153,2166,2118,2258,2401,2264,2076,2089]
["Region 2","Product 4","Customer 10","Person 10",737,604,749,669,740,724,600,671,603,624,700,693,631,701,693,792,672,691,698,683,643,668,719,702,16407,"Thin Laptop","Military","Norene McNeece",2090,2133,1874,2017,2025,2155,2024,2089]
["Region 2","Product 4","Customer 11","Person 11",849,989,1062,1241,1193,847,1212,1000,1378,1198,1319,898,1203,800,1341,861,1383,1198,1186,921,1358,1352,1376,1387,27552,"Thin Laptop","Corporation","Rick Boehm",2900,3281,3590,3415,3344,3442,3465,4115]
["Region 2","Product 4","Customer 12","Person 12",655,552,783,759,655,754,796,634,600,652,585,707,767,601,684,755,713,756,729,610,699,755,685,752,16638,"Thin Laptop","NPO/NGO","Sueann Olivero",1990,2168,2030,1944,2052,2224,2038,2192]
["Region 2","Product 5","Customer 1","Person 1",828,752,854,899,822,701,826,833,724,612,872,768,797,699,645,835,765,610,685,608,674,613,847,821,18090,"Economy Laptop","College Student","Bo Kornegay",2434,2422,2383,2252,2141,2210,1967,2281]
["Region 2","Product 5","Customer 2","Person 2",701,880,768,803,629,688,764,814,832,883,721,879,674,727,633,733,746,682,839,610,753,847,641,745,17992,"Economy Laptop","Post Graduate Student","Britta Blakley",2349,2120,2410,2483,2034,2161,2202,2233]
["Region 2","Product 5","Customer 3","Person 3",636,608,662,734,766,627,673,761,785,685,769,705,678,644,726,793,786,693,713,701,650,637,770,608,16810,"Economy Laptop","Full-time Parent","Brock Stalder",1906,2127,2219,2159,2048,2272,2064,2015]
["Region 2","Product 5","Customer 4","Person 4",854,1079,1313,1214,1393,1176,1272,1288,829,1277,1165,856,953,1070,1297,1261,1037,1179,1147,838,1038,895,804,1025,26260,"Economy Laptop","Self-Employed","Catherine Shoaff",3246,3783,3389,3298,3320,3477,3023,2724]
["Region 2","Product 5","Customer 5","Person 5",678,599,569,766,664,650,763,662,733,718,726,585,568,612,603,716,623,782,725,753,774,672,570,732,16243,"Economy Laptop","Full-time Employee","Fermin Quin",1846,2080,2158,2029,1783,2121,2252,1974]
["Region 2","Product 5","Customer 6","Person 6",848,755,642,600,749,742,667,642,601,831,792,743,605,834,884,795,728,791,641,832,696,684,810,692,17604,"Economy Laptop","Business Owner","Glenda Harbaugh",2245,2091,1910,2366,2323,2314,2169,2186]
["Region 2","Product 5","Customer 7","Person 7",739,850,712,733,873,638,850,900,725,735,824,735,811,870,793,712,771,881,894,651,684,674,763,878,18696,"Economy Laptop","Maintstream Youth","Jarrett Rimmer",2301,2244,2475,2294,2474,2364,2229,2315]
["Region 2","Product 5","Customer 8","Person 8",799,763,771,671,763,675,735,798,744,627,730,677,783,661,769,630,778,642,662,799,690,727,794,664,17352,"Economy Laptop","Retired","Li Bruni",2333,2109,2277,2034,2213,2050,2151,2185]
["Region 2","Product 5","Customer 9","Person 9",1253,1047,1370,1061,974,853,927,1030,1163,890,1057,1025,1084,895,951,1186,1084,931,1064,997,1070,1265,1294,1277,25748,"Economy Laptop","Government","Linwood Camargo",3670,2888,3120,2972,2930,3201,3131,3836]
["Region 2","Product 5","Customer 10","Person 10",798,727,572,608,602,800,688,617,800,658,675,618,717,635,566,618,697,761,552,760,609,686,733,698,16195,"Economy Laptop","Military","Norene McNeece",2097,2010,2105,1951,1918,2076,1921,2117]
["Region 2","Product 5","Customer 11","Person 11",794,698,694,834,760,817,807,706,801,775,760,610,781,635,816,757,841,660,819,794,899,657,827,665,18207,"Economy Laptop","Corporation","Rick Boehm",2186,2411,2314,2145,2232,2258,2512,2149]
["Region 2","Product 5","Customer 12","Person 12",854,631,878,807,833,886,708,875,879,681,673,737,875,898,877,743,860,801,713,618,673,879,670,643,18692,"Economy Laptop","NPO/NGO","Sueann Olivero",2363,2526,2462,2091,2650,2404,2004,2192]
["Region 2","Product 6","Customer 1","Person 1",778,663,675,714,785,625,604,642,731,646,715,798,734,664,784,656,783,732,607,667,707,629,626,743,16708,"Series 8000 Tablet","College Student","Bo Kornegay",2116,2124,1977,2159,2182,2171,1981,1998]
["Region 2","Product 6","Customer 2","Person 2",1017,884,1098,1292,927,889,974,919,1393,1027,999,1230,1245,1284,1061,1192,1387,1256,1076,1188,821,1063,1088,937,26247,"Series 8000 Tablet","Post Graduate Student","Britta Blakley",2999,3108,3286,3256,3590,3835,3085,3088]
["Region 2","Product 6","Customer 3","Person 3",708,715,723,711,774,653,557,779,586,744,590,793,656,585,601,788,618,611,793,679,689,640,645,596,16234,"Series 8000 Tablet","Full-time Parent","Brock Stalder",2146,2138,1922,2127,1842,2017,2161,1881]
["Region 2","Product 6","Customer 4","Person 4",654,738,647,799,620,897,625,839,653,651,871,788,642,809,795,825,894,615,622,646,766,753,674,722,17545,"Series 8000 Tablet","Self-Employed","Catherine Shoaff",2039,2316,2117,2310,2246,2334,2034,2149]
["Region 2","Product 6","Customer 5","Person 5",617,798,891,674,605,844,804,857,836,648,640,776,711,849,759,758,744,775,799,649,830,707,858,855,18284,"Series 8000 Tablet","Full-time Employee","Fermin Quin",2306,2123,2497,2064,2319,2277,2278,2420]
["Region 2","Product 6","Customer 6","Person 6",707,603,687,671,628,764,799,623,740,640,609,702,624,633,687,716,711,611,760,752,655,614,762,770,{"$f":"SUM(E68:AB68)","v":16468},"Series 8000 Tablet","Business Owner","Glenda Harbaugh",{"$f":"SUM(E68:G68)","v":1997},{"$f":"SUM(H68:J68)","v":2063},{"$f":"SUM(K68:M68)","v":2162},{"$f":"SUM(N68:P68)","v":1951},{"$f":"SUM(Q68:S68)","v":1944},{"$f":"SUM(T68:V68)","v":2038},{"$f":"SUM(W68:Y68)","v":2167},{"$f":"SUM(Z68:AB68)","v":2146}]
["Region 2","Product 6","Customer 7","Person 7",845,900,1044,982,1390,810,973,802,1320,1185,1175,907,1218,1089,942,1276,1388,1171,1277,897,1130,812,1280,1307,26120,"Series 8000 Tablet","Maintstream Youth","Jarrett Rimmer",2789,3182,3095,3267,3249,3835,3304,3399]
["Region 2","Product 6","Customer 8","Person 8",647,558,571,578,794,759,652,704,616,574,787,581,551,794,605,566,646,760,573,640,592,695,554,639,15436,"Series 8000 Tablet","Retired","Li Bruni",1776,2131,1972,1942,1950,1972,1805,1888]
["Region 2","Product 6","Customer 9","Person 9",622,743,803,851,749,810,797,700,718,784,606,601,787,645,665,624,731,683,713,626,728,854,740,635,17215,"Series 8000 Tablet","Government","Linwood Camargo",2168,2410,2215,1991,2097,2038,2067,2229]
["Region 2","Product 6","Customer 10","Person 10",601,608,782,844,688,666,777,699,751,762,706,878,736,744,822,881,694,761,757,744,806,782,820,728,18037,"Series 8000 Tablet","Military","Norene McNeece",1991,2198,2227,2346,2302,2336,2307,2330]
["Region 2","Product 6","Customer 11","Person 11",674,674,748,650,762,665,638,710,664,753,624,791,604,776,715,647,625,681,610,607,705,638,647,685,16293,"Series 8000 Tablet","Corporation","Rick Boehm",2096,2077,2012,2168,2095,1953,1922,1970]
["Region 2","Product 6","Customer 12","Person 12",805,808,1291,1234,1361,1241,1095,1151,848,1105,1332,1264,1280,1307,874,1278,1137,928,1352,1056,1113,1132,920,1014,26926,"Series 8000 Tablet","NPO/NGO","Sueann Olivero",2904,3836,3094,3701,3461,3343,3521,3066]
["Region 3","Product 7","Customer 1","Person 1",589,749,694,739,752,723,667,723,557,671,754,702,591,571,722,678,715,780,637,597,579,572,568,723,16053,"Series 5000 Tablet","College Student","Bo Kornegay",2032,2214,1947,2127,1884,2173,1813,1863]
["Region 3","Product 7","Customer 2","Person 2",766,779,632,885,607,737,611,817,738,795,670,646,875,746,675,842,865,841,697,633,682,844,863,897,18143,{"$f":"VLOOKUP(B76,lookup,2,FALSE)","v":"Series 5000 Tablet"},{"$f":"VLOOKUP(C76,lookup,2,FALSE)","v":"Post Graduate Student"},{"$f":"VLOOKUP(D76,lookup,2,FALSE)","v":"Britta Blakley"},2177,2229,2166,2111,2296,2548,2012,2604]
["Region 3","Product 7","Customer 3","Person 3",887,876,616,862,876,623,750,745,784,804,849,623,889,652,784,874,767,884,694,647,832,745,644,610,18317,"Series 5000 Tablet","Full-time Parent","Brock Stalder",2379,2361,2279,2276,2325,2525,2173,1999]
["Region 3","Product 7","Customer 4","Person 4",635,741,692,646,626,605,672,693,667,718,709,716,738,649,770,760,656,618,660,789,784,617,797,632,16590,"Series 5000 Tablet","Self-Employed","Catherine Shoaff",2068,1877,2032,2143,2157,2034,2233,2046]
["Region 3","Product 7","Customer 5","Person 5",916,1331,814,1060,1097,949,1173,830,1153,1345,1085,1106,1055,1399,1100,1195,1122,1340,905,1369,1312,981,1229,1398,27264,"Series 5000 Tablet","Full-time Employee","Fermin Quin",3061,3106,3156,3536,3554,3657,3586,3608]
["Region 3","Product 7","Customer 6","Person 6",694,705,666,661,710,657,649,655,643,570,670,697,664,620,563,572,580,628,789,699,778,697,563,599,15729,"Series 5000 Tablet","Business Owner","Glenda Harbaugh",2065,2028,1947,1937,1847,1780,2266,1859]
["Region 3","Product 7","Customer 7","Person 7",805,859,755,871,889,758,652,800,804,890,828,741,831,688,821,617,687,604,896,831,832,802,774,861,18896,"Series 5000 Tablet","Maintstream Youth","Jarrett Rimmer",2419,2518,2256,2459,2340,1908,2559,2437]
["Region 3","Product 7","Customer 8","Person 8",670,622,810,726,827,780,622,897,603,639,786,868,884,667,839,725,685,663,616,847,885,762,806,686,17915,"Series 5000 Tablet","Retired","Li Bruni",2102,2333,2122,2293,2390,2073,2348,2254]
["Region 3","Product 7","Customer 9","Person 9",680,799,641,796,641,657,715,759,753,612,775,764,685,769,754,674,759,671,643,676,624,684,641,664,16836,"Series 5000 Tablet","Government","Linwood Camargo",2120,2094,2227,2151,2208,2104,1943,1989]
["Region 3","Product 7","Customer 10","Person 10",875,944,866,1224,1184,1149,1386,1120,1375,1185,1188,1003,1322,1175,1140,1002,892,1149,1204,1216,1312,957,1104,1188,27160,"Series 5000 Tablet","Military","Norene McNeece",2685,3557,3881,3376,3637,3043,3732,3249]
["Region 3","Product 7","Customer 11","Person 11",749,609,788,755,763,645,606,651,660,630,775,795,664,714,667,642,654,676,552,595,644,785,633,800,16452,"Series 5000 Tablet","Corporation","Rick Boehm",2146,2163,1917,2200,2045,1972,1791,2218]
["Region 3","Product 7","Customer 12","Person 12",756,603,666,739,774,706,878,658,780,664,700,656,684,894,685,713,626,691,776,801,728,600,603,689,17070,"Series 5000 Tablet","NPO/NGO","Sueann Olivero",2025,2219,2316,2020,2263,2030,2305,1892]
["Region 3","Product 8","Customer 1","Person 1",657,775,756,642,840,734,703,711,617,683,760,706,748,687,639,764,802,748,775,624,815,647,692,687,17212,"Hybrid Laptop LED","College Student","Bo Kornegay",2188,2216,2031,2149,2074,2314,2214,2026]
["Region 3","Product 8","Customer 2","Person 2",631,643,767,774,742,711,673,742,717,779,647,657,607,762,797,670,661,789,615,748,630,764,782,623,16931,"Hybrid Laptop LED","Post Graduate Student","Britta Blakley",2041,2227,2132,2083,2166,2120,1993,2169]
["Region 3","Product 8","Customer 3","Person 3",1156,1230,858,1239,1009,1191,1043,1051,971,874,1135,1246,1049,1143,1369,1317,835,990,1002,992,900,1154,1120,1361,26235,"Hybrid Laptop LED","Full-time Parent","Brock Stalder",3244,3439,3065,3255,3561,3142,2894,3635]
["Region 3","Product 8","Customer 4","Person 4",681,610,753,709,689,723,566,673,796,720,728,765,789,765,723,746,767,673,662,577,571,787,712,800,16985,"Hybrid Laptop LED","Self-Employed","Catherine Shoaff",2044,2121,2035,2213,2277,2186,1810,2299]
["Region 3","Product 8","Customer 5","Person 5",693,684,887,827,836,885,743,767,868,655,900,643,777,714,714,671,666,798,731,655,731,827,751,653,18076,"Hybrid Laptop LED","Full-time Employee","Fermin Quin",2264,2548,2378,2198,2205,2135,2117,2231]
["Region 3","Product 8","Customer 6","Person 6",693,659,792,899,758,748,733,674,689,859,642,682,875,754,857,897,839,818,617,815,756,794,682,899,18431,"Hybrid Laptop LED","Business Owner","Glenda Harbaugh",2144,2405,2096,2183,2486,2554,2188,2375]
["Region 3","Product 8","Customer 7","Person 7",673,744,669,660,650,635,724,644,667,687,707,617,655,655,646,612,722,619,736,636,617,638,718,761,16092,"Hybrid Laptop LED","Maintstream Youth","Jarrett Rimmer",2086,1945,2035,2011,1956,1953,1989,2117]
["Region 3","Product 8","Customer 8","Person 8",1189,924,875,1162,822,924,1207,1108,875,1363,825,1342,1238,887,1185,859,1375,922,1309,1076,941,1100,939,881,25328,"Hybrid Laptop LED","Retired","Li Bruni",2988,2908,3190,3530,3310,3156,3326,2920]
["Region 3","Product 8","Customer 9","Person 9",776,768,581,702,713,763,568,614,675,661,704,604,791,648,650,732,749,590,759,777,647,589,668,559,16288,"Hybrid Laptop LED","Government","Linwood Camargo",2125,2178,1857,1969,2089,2071,2183,1816]
["Region 3","Product 8","Customer 10","Person 10",680,862,810,794,818,752,663,769,855,894,697,853,881,899,716,875,651,606,686,641,862,734,642,797,18437,"Hybrid Laptop LED","Military","Norene McNeece",2352,2364,2287,2444,2496,2132,2189,2173]
["Region 3","Product 8","Customer 11","Person 11",632,606,731,692,724,848,661,858,772,655,661,715,724,762,685,608,864,857,900,628,858,678,711,604,17434,"Hybrid Laptop LED","Corporation","Rick Boehm",1969,2264,2291,2031,2171,2329,2386,1993]
["Region 3","Product 8","Customer 12","Person 12",666,725,764,796,726,627,707,682,614,731,663,689,702,708,668,644,702,713,631,738,682,771,725,630,16704,"Hybrid Laptop LED","NPO/NGO","Sueann Olivero",2155,2149,2003,2083,2078,2059,2051,2126]
["Region 3","Product 9","Customer 1","Person 1",1098,802,1077,1150,839,1364,1057,960,1385,1004,1356,1222,833,1379,1184,980,1137,1310,889,1275,1275,983,1190,1277,27026,"Elite Laptop","College Student","Bo Kornegay",2977,3353,3402,3582,3396,3427,3439,3450]
["Region 3","Product 9","Customer 2","Person 2",740,556,672,650,606,558,769,662,613,554,718,579,612,682,780,559,796,578,630,709,695,654,698,636,15706,"Elite Laptop","Post Graduate Student","Britta Blakley",1968,1814,2044,1851,2074,1933,2034,1988]
["Region 3","Product 9","Customer 3","Person 3",772,896,827,868,883,807,673,693,635,710,836,796,837,898,808,760,635,881,668,877,736,646,743,836,18721,"Elite Laptop","Full-time Parent","Brock Stalder",2495,2558,2001,2342,2543,2276,2281,2225]
["Region 3","Product 9","Customer 4","Person 4",829,814,879,898,755,793,667,835,896,830,789,714,848,727,887,833,724,736,798,618,716,880,624,865,18955,"Elite Laptop","Self-Employed","Catherine Shoaff",2522,2446,2398,2333,2462,2293,2132,2369]
["Region 3","Product 9","Customer 5","Person 5",755,635,727,621,643,706,669,726,744,767,713,647,659,774,602,697,758,622,623,730,781,677,633,771,16680,"Elite Laptop","Full-time Employee","Fermin Quin",2117,1970,2139,2127,2035,2077,2134,2081]
["Region 3","Product 9","Customer 6","Person 6",991,879,810,1277,1074,1010,1287,883,1260,887,1327,1018,1021,807,1240,832,1214,993,1334,1084,901,881,819,1396,25225,"Elite Laptop","Business Owner","Glenda Harbaugh",2680,3361,3430,3232,3068,3039,3319,3096]
["Region 3","Product 9","Customer 7","Person 7",648,681,677,602,769,715,571,588,669,695,605,766,623,774,759,677,670,585,680,741,551,765,609,760,16180,"Elite Laptop","Maintstream Youth","Jarrett Rimmer",2006,2086,1828,2066,2156,1932,1972,2134]
["Region 3","Product 9","Customer 8","Person 8",856,662,742,799,636,865,621,653,731,756,708,614,728,807,633,841,767,637,696,633,706,687,754,736,17268,"Elite Laptop","Retired","Li Bruni",2260,2300,2005,2078,2168,2245,2035,2177]
["Region 3","Product 9","Customer 9","Person 9",750,735,716,883,635,798,779,612,695,659,640,630,641,761,624,605,651,883,870,890,803,888,773,838,17759,"Elite Laptop","Government","Linwood Camargo",2201,2316,2086,1929,2026,2139,2563,2499]
["Region 3","Product 9","Customer 10","Person 10",615,786,686,603,725,667,658,646,643,636,681,649,774,638,786,641,766,778,646,649,646,717,632,788,16456,{"$f":"VLOOKUP(B108,lookup,2,FALSE)","v":"Elite Laptop"},{"$f":"VLOOKUP(C108,lookup,2,FALSE)","v":"Military"},{"$f":"VLOOKUP(D108,lookup,2,FALSE)","v":"Norene McNeece"},2087,1995,1947,1966,2198,2185,1941,2137]
["Region 3","Product 9","Customer 11","Person 11",907,935,1026,1002,1248,1339,1183,1337,1189,1393,1337,1064,904,1076,834,1142,1169,1115,1354,1316,1268,1283,1393,958,27772,"Elite Laptop","Corporation","Rick Boehm",2868,3589,3709,3794,2814,3426,3938,3634]
["Region 3","Product 9","Customer 12","Person 12",751,560,567,605,587,550,753,737,783,637,644,687,709,748,768,557,609,671,736,609,658,768,560,700,15954,"Elite Laptop","NPO/NGO","Sueann Olivero",1878,1742,2273,1968,2225,1837,2003,2028]
["Region 4","Product 10","Customer 1","Person 1",697,725,800,658,819,761,661,700,819,796,894,705,893,672,663,854,847,624,823,736,725,824,659,877,18232,"All-in-one Desktop","College Student","Bo Kornegay",2222,2238,2180,2395,2228,2325,2284,2360]
["Region 4","Product 10","Customer 2","Person 2",733,808,765,898,611,816,848,615,628,717,891,762,884,654,800,875,690,751,693,874,860,769,702,767,18411,"All-in-one Desktop","Post Graduate Student","Britta Blakley",2306,2325,2091,2370,2338,2316,2427,2238]
["Region 4","Product 10","Customer 3","Person 3",645,799,669,749,688,800,669,686,624,666,636,729,675,789,754,722,621,799,625,651,771,711,721,651,16850,"All-in-one Desktop","Full-time Parent","Brock Stalder",2113,2237,1979,2031,2218,2142,2047,2083]
["Region 4","Product 10","Customer 4","Person 4",844,1170,1292,1009,1103,919,1377,1352,1277,899,1131,827,1375,882,812,1274,1172,1170,879,1274,1208,943,1187,1253,26629,"All-in-one Desktop","Self-Employed","Catherine Shoaff",3306,3031,4006,2857,3069,3616,3361,3383]
["Region 4","Product 10","Customer 5","Person 5",675,649,717,641,610,715,661,764,703,614,561,694,738,703,728,565,737,706,699,788,736,791,762,696,16653,"All-in-one Desktop","Full-time Employee","Fermin Quin",2041,1966,2128,1869,2169,2008,2223,2249]
["Region 4","Product 10","Customer 6","Person 6",661,804,658,603,631,639,635,662,627,679,709,844,766,819,832,603,645,657,688,750,758,650,899,793,17012,"All-in-one Desktop","Business Owner","Glenda Harbaugh",2123,1873,1924,2232,2417,1905,2196,2342]
["Region 4","Product 10","Customer 7","Person 7",618,672,876,900,799,742,624,898,623,883,679,617,766,684,768,669,749,874,805,747,789,781,768,778,18109,"All-in-one Desktop","Maintstream Youth","Jarrett Rimmer",2166,2441,2145,2179,2218,2292,2341,2327]
["Region 4","Product 10","Customer 8","Person 8",619,686,692,771,672,675,769,640,721,641,678,698,781,648,665,748,743,653,770,640,730,789,768,617,16814,"All-in-one Desktop","Retired","Li Bruni",1997,2118,2130,2017,2094,2144,2140,2174]
["Region 4","Product 10","Customer 9","Person 9",1363,1185,1078,1197,897,1218,1070,1145,1290,1299,1154,1375,1034,1215,999,1392,1248,1284,1084,1036,1248,986,1399,1161,28357,"All-in-one Desktop","Government","Linwood Camargo",3626,3312,3505,3828,3248,3924,3368,3546]
["Region 4","Product 10","Customer 10","Person 10",638,736,607,652,694,607,670,652,774,552,755,622,665,559,583,736,599,714,756,566,693,621,575,797,15823,"All-in-one Desktop","Military","Norene McNeece",1981,1953,2096,1929,1807,2049,2015,1993]
["Region 4","Product 10","Customer 11","Person 11",616,778,650,655,737,786,745,865,604,886,639,611,770,684,714,603,724,705,751,874,891,604,890,742,17524,"All-in-one Desktop","Corporation","Rick Boehm",2044,2178,2214,2136,2168,2032,2516,2236]
["Region 4","Product 10","Customer 12","Person 12",899,712,668,683,851,697,692,796,735,741,651,851,810,659,861,742,680,664,706,716,602,634,852,853,17755,"All-in-one Desktop","NPO/NGO","Sueann Olivero",2279,2231,2223,2243,2330,2086,2024,2339]
["Region 4","Product 11","Customer 1","Person 1",671,721,658,729,627,632,693,650,778,649,602,666,787,760,761,755,717,602,746,701,754,640,638,693,16630,"Gamer's Desktop","College Student","Bo Kornegay",2050,1988,2121,1917,2308,2074,2201,1971]
["Region 4","Product 11","Customer 2","Person 2",1232,1311,1225,1087,1128,1320,943,1289,1186,1328,928,1345,1167,812,801,1374,949,980,1108,1058,1175,1201,1034,1376,27357,"Gamer's Desktop","Post Graduate Student","Britta Blakley",3768,3535,3418,3601,2780,3303,3341,3611]
["Region 4","Product 11","Customer 3","Person 3",788,586,639,789,778,632,774,681,614,635,561,581,659,737,745,564,749,764,793,684,789,718,551,742,16553,"Gamer's Desktop","Full-time Parent","Brock Stalder",2013,2199,2069,1777,2141,2077,2266,2011]
["Region 4","Product 11","Customer 4","Person 4",617,783,802,757,888,738,840,691,653,809,611,671,616,798,768,657,758,776,896,680,702,842,897,606,17856,"Gamer's Desktop","Self-Employed","Catherine Shoaff",2202,2383,2184,2091,2182,2191,2278,2345]
["Region 4","Product 11","Customer 5","Person 5",630,769,882,600,764,646,900,797,708,857,789,862,772,665,633,779,796,615,723,649,888,692,631,635,17682,"Gamer's Desktop","Full-time Employee","Fermin Quin",2281,2010,2405,2508,2070,2190,2260,1958]
["Region 4","Product 11","Customer 6","Person 6",631,796,639,606,759,781,744,692,682,620,746,696,636,695,614,783,630,629,703,795,714,769,795,632,16787,"Gamer's Desktop","Business Owner","Glenda Harbaugh",2066,2146,2118,2062,1945,2042,2212,2196]
["Region 4","Product 11","Customer 7","Person 7",1079,1033,931,1336,1208,1345,903,1330,976,1104,968,901,1237,1252,1390,885,1228,998,888,995,1189,1328,1131,1260,26895,"Gamer's Desktop","Maintstream Youth","Jarrett Rimmer",3043,3889,3209,2973,3879,3111,3072,3719]
["Region 4","Product 11","Customer 8","Person 8",782,638,762,710,749,643,622,660,586,568,777,688,638,712,583,578,575,726,603,575,634,579,696,746,15830,"Gamer's Desktop","Retired","Li Bruni",2182,2102,1868,2033,1933,1879,1812,2021]
["Region 4","Product 11","Customer 9","Person 9",627,839,729,701,691,646,804,663,861,793,706,820,845,884,736,853,621,887,759,709,817,702,637,684,18014,"Gamer's Desktop","Government","Linwood Camargo",2195,2038,2328,2319,2465,2361,2285,2023]
["Region 4","Product 11","Customer 10","Person 10",625,706,782,896,670,631,847,898,628,854,617,900,890,704,814,720,900,814,811,797,837,858,728,706,{"$f":"SUM(E132:AB132)","v":18633},"Gamer's Desktop","Military","Norene McNeece",{"$f":"SUM(E132:G132)","v":2113},{"$f":"SUM(H132:J132)","v":2197},{"$f":"SUM(K132:M132)","v":2373},{"$f":"SUM(N132:P132)","v":2371},{"$f":"SUM(Q132:S132)","v":2408},{"$f":"SUM(T132:V132)","v":2434},{"$f":"SUM(W132:Y132)","v":2445},{"$f":"SUM(Z132:AB132)","v":2292}]
["Region 4","Product 11","Customer 11","Person 11",681,793,757,666,737,654,638,610,647,770,770,797,669,601,745,630,663,768,767,719,748,726,770,675,17001,"Gamer's Desktop","Corporation","Rick Boehm",2231,2057,1895,2337,2015,2061,2234,2171]
["Region 4","Product 11","Customer 12","Person 12",950,1060,1276,1073,1238,802,1207,1115,1043,1170,1236,1318,1204,1212,1350,1276,939,1081,1006,981,847,1120,1332,1029,26865,"Gamer's Desktop","NPO/NGO","Sueann Olivero",3286,3113,3365,3724,3766,3296,2834,3481]
["Region 4","Product 12","Customer 1","Person 1",620,562,647,598,643,598,695,636,781,566,734,727,800,780,739,685,555,644,769,759,688,657,651,707,16241,"Elite Desktop","College Student","Bo Kornegay",1829,1839,2112,2027,2319,1884,2216,2015]
["Region 4","Product 12","Customer 2","Person 2",856,724,765,883,892,761,857,796,613,723,716,842,802,616,839,661,834,698,625,655,624,659,775,689,17905,"Elite Desktop","Post Graduate Student","Britta Blakley",2345,2536,2266,2281,2257,2193,1904,2123]
["Region 4","Product 12","Customer 3","Person 3",662,794,893,667,605,812,604,880,898,788,886,755,609,848,602,857,686,673,655,750,752,794,734,661,17865,"Elite Desktop","Full-time Parent","Brock Stalder",2349,2084,2382,2429,2059,2216,2157,2189]
["Region 4","Product 12","Customer 4","Person 4",719,787,609,634,700,725,759,640,745,615,773,638,709,764,644,761,614,752,761,720,781,692,705,676,16923,"Elite Desktop","Self-Employed","Catherine Shoaff",2115,2059,2144,2026,2117,2127,2262,2073]
["Region 4","Product 12","Customer 5","Person 5",1239,1385,823,1069,1336,857,869,901,812,1352,1084,1081,1323,1261,1334,1372,949,1165,962,1211,1304,956,1214,1097,26956,"Elite Desktop","Full-time Employee","Fermin Quin",3447,3262,2582,3517,3918,3486,3477,3267]
["Region 4","Product 12","Customer 6","Person 6",665,781,580,798,618,685,571,672,730,588,610,568,712,746,602,599,661,587,586,693,622,681,614,706,15675,{"$f":"VLOOKUP(B140,lookup,2,FALSE)","v":"Elite Desktop"},{"$f":"VLOOKUP(C140,lookup,2,FALSE)","v":"Business Owner"},{"$f":"VLOOKUP(D140,lookup,2,FALSE)","v":"Glenda Harbaugh"},2026,2101,1973,1766,2060,1847,1901,2001]
["Region 4","Product 12","Customer 7","Person 7",688,716,797,618,628,745,731,773,724,741,656,611,750,755,890,776,726,849,627,679,781,875,803,898,17837,"Elite Desktop","Maintstream Youth","Jarrett Rimmer",2201,1991,2228,2008,2395,2351,2087,2576]
["Region 4","Product 12","Customer 8","Person 8",833,736,643,887,725,702,653,682,753,712,800,668,856,666,692,770,672,896,674,817,898,769,674,638,17816,"Elite Desktop","Retired","Li Bruni",2212,2314,2088,2180,2214,2338,2389,2081]
["Region 4","Product 12","Customer 9","Person 9",749,683,739,714,742,767,676,670,629,683,625,616,646,625,717,604,758,604,715,647,753,704,764,721,16551,"Elite Desktop","Government","Linwood Camargo",2171,2223,1975,1924,1988,1966,2115,2189]
["Region 4","Product 12","Customer 10","Person 10",819,870,817,1178,917,941,1017,1118,1316,1035,1045,1026,1348,1302,1119,1181,1210,1157,902,1311,1097,1199,1034,1118,26077,"Elite Desktop","Military","Norene McNeece",2506,3036,3451,3106,3769,3548,3310,3351]
["Region 4","Product 12","Customer 11","Person 11",653,727,768,756,595,577,796,740,551,776,601,651,637,561,608,658,621,787,702,582,611,698,694,695,16045,"Elite Desktop","Corporation","Rick Boehm",2148,1928,2087,2028,1806,2066,1895,2087]
["Region 4","Product 12","Customer 12","Person 12",727,696,821,629,715,847,760,759,879,697,690,844,668,624,657,834,795,730,896,790,648,782,777,845,18110,"Elite Desktop","NPO/NGO","Sueann Olivero",2244,2191,2398,2231,1949,2359,2334,2404]

{"sheet":"Sum Over Time","index":3,"n_rows":14,"n_cols":9,"rows_kept":14,"cut":false,"hidden":false,"merged":[]}
["Region:",{"$f":"Dashboard!C17","v":"All Regions"}]
["Product","Q1 2011","Q2 2011","Q3 2011","Q4 2011","Q1 2012","Q2 2012","Q3 2012","Q4 2012"]
["All-in-one Desktop",{"$f":"SUM(IF(products=$A3,IF($B$1=\"All Regions\",qtr1_2011,IF(region=$B$1,qtr1_2011))))","v":28204},{"$f":"SUM(IF(products=$A3,IF($B$1=\"All Regions\",qtr2_2011,IF(region=$B$1,qtr2_2011))))","v":27903},{"$f":"SUM(IF(products=$A3,IF($B$1=\"All Regions\",qtr3_2011,IF(region=$B$1,qtr3_2011))))","v":28621},{"$f":"SUM(IF(products=$A3,IF($B$1=\"All Regions\",qtr4_2011,IF(region=$B$1,qtr4_2011))))","v":28086},{"$f":"SUM(IF(products=$A3,IF($B$1=\"All Regions\",qtr1_2012,IF(region=$B$1,qtr1_2012))))","v":28304},{"$f":"SUM(IF(products=$A3,IF($B$1=\"All Regions\",qtr2_2012,IF(region=$B$1,qtr2_2012))))","v":28839},{"$f":"SUM(IF(products=$A3,IF($B$1=\"All Regions\",qtr3_2012,IF(region=$B$1,qtr3_2012))))","v":28942},{"$f":"SUM(IF(products=$A3,IF($B$1=\"All Regions\",qtr4_2012,IF(region=$B$1,qtr4_2012))))","v":29270}]
["Economy Laptop",{"$f":"SUM(IF(products=$A4,IF($B$1=\"All Regions\",qtr1_2011,IF(region=$B$1,qtr1_2011))))","v":28976},{"$f":"SUM(IF(products=$A4,IF($B$1=\"All Regions\",qtr2_2011,IF(region=$B$1,qtr2_2011))))","v":28811},{"$f":"SUM(IF(products=$A4,IF($B$1=\"All Regions\",qtr3_2011,IF(region=$B$1,qtr3_2011))))","v":29222},{"$f":"SUM(IF(products=$A4,IF($B$1=\"All Regions\",qtr4_2011,IF(region=$B$1,qtr4_2011))))","v":28074},{"$f":"SUM(IF(products=$A4,IF($B$1=\"All Regions\",qtr1_2012,IF(region=$B$1,qtr1_2012))))","v":28066},{"$f":"SUM(IF(products=$A4,IF($B$1=\"All Regions\",qtr2_2012,IF(region=$B$1,qtr2_2012))))","v":28908},{"$f":"SUM(IF(products=$A4,IF($B$1=\"All Regions\",qtr3_2012,IF(region=$B$1,qtr3_2012))))","v":27625},{"$f":"SUM(IF(products=$A4,IF($B$1=\"All Regions\",qtr4_2012,IF(region=$B$1,qtr4_2012))))","v":28207}]
["Elite Desktop",{"$f":"SUM(IF(products=$A5,IF($B$1=\"All Regions\",qtr1_2011,IF(region=$B$1,qtr1_2011))))","v":27593},{"$f":"SUM(IF(products=$A5,IF($B$1=\"All Regions\",qtr2_2011,IF(region=$B$1,qtr2_2011))))","v":27564},{"$f":"SUM(IF(products=$A5,IF($B$1=\"All Regions\",qtr3_2011,IF(region=$B$1,qtr3_2011))))","v":27686},{"$f":"SUM(IF(products=$A5,IF($B$1=\"All Regions\",qtr4_2011,IF(region=$B$1,qtr4_2011))))","v":27523},{"$f":"SUM(IF(products=$A5,IF($B$1=\"All Regions\",qtr1_2012,IF(region=$B$1,qtr1_2012))))","v":28851},{"$f":"SUM(IF(products=$A5,IF($B$1=\"All Regions\",qtr2_2012,IF(region=$B$1,qtr2_2012))))","v":28381},{"$f":"SUM(IF(products=$A5,IF($B$1=\"All Regions\",qtr3_2012,IF(region=$B$1,qtr3_2012))))","v":28047},{"$f":"SUM(IF(products=$A5,IF($B$1=\"All Regions\",qtr4_2012,IF(region=$B$1,qtr4_2012))))","v":28356}]
["Elite Laptop",{"$f":"SUM(IF(products=$A6,IF($B$1=\"All Regions\",qtr1_2011,IF(region=$B$1,qtr1_2011))))","v":28059},{"$f":"SUM(IF(products=$A6,IF($B$1=\"All Regions\",qtr2_2011,IF(region=$B$1,qtr2_2011))))","v":29530},{"$f":"SUM(IF(products=$A6,IF($B$1=\"All Regions\",qtr3_2011,IF(region=$B$1,qtr3_2011))))","v":29262},{"$f":"SUM(IF(products=$A6,IF($B$1=\"All Regions\",qtr4_2011,IF(region=$B$1,qtr4_2011))))","v":29268},{"$f":"SUM(IF(products=$A6,IF($B$1=\"All Regions\",qtr1_2012,IF(region=$B$1,qtr1_2012))))","v":29165},{"$f":"SUM(IF(products=$A6,IF($B$1=\"All Regions\",qtr2_2012,IF(region=$B$1,qtr2_2012))))","v":28809},{"$f":"SUM(IF(products=$A6,IF($B$1=\"All Regions\",qtr3_2012,IF(region=$B$1,qtr3_2012))))","v":29791},{"$f":"SUM(IF(products=$A6,IF($B$1=\"All Regions\",qtr4_2012,IF(region=$B$1,qtr4_2012))))","v":29818}]
["Gamer's Desktop",{"$f":"SUM(IF(products=$A7,IF($B$1=\"All Regions\",qtr1_2011,IF(region=$B$1,qtr1_2011))))","v":29430},{"$f":"SUM(IF(products=$A7,IF($B$1=\"All Regions\",qtr2_2011,IF(region=$B$1,qtr2_2011))))","v":29657},{"$f":"SUM(IF(products=$A7,IF($B$1=\"All Regions\",qtr3_2011,IF(region=$B$1,qtr3_2011))))","v":29353},{"$f":"SUM(IF(products=$A7,IF($B$1=\"All Regions\",qtr4_2011,IF(region=$B$1,qtr4_2011))))","v":29713},{"$f":"SUM(IF(products=$A7,IF($B$1=\"All Regions\",qtr1_2012,IF(region=$B$1,qtr1_2012))))","v":29892},{"$f":"SUM(IF(products=$A7,IF($B$1=\"All Regions\",qtr2_2012,IF(region=$B$1,qtr2_2012))))","v":29019},{"$f":"SUM(IF(products=$A7,IF($B$1=\"All Regions\",qtr3_2012,IF(region=$B$1,qtr3_2012))))","v":29240},{"$f":"SUM(IF(products=$A7,IF($B$1=\"All Regions\",qtr4_2012,IF(region=$B$1,qtr4_2012))))","v":29799}]
["Hybrid Laptop",{"$f":"SUM(IF(products=$A8,IF($B$1=\"All Regions\",qtr1_2011,IF(region=$B$1,qtr1_2011))))","v":27328},{"$f":"SUM(IF(products=$A8,IF($B$1=\"All Regions\",qtr2_2011,IF(region=$B$1,qtr2_2011))))","v":28624},{"$f":"SUM(IF(products=$A8,IF($B$1=\"All Regions\",qtr3_2011,IF(region=$B$1,qtr3_2011))))","v":28842},{"$f":"SUM(IF(products=$A8,IF($B$1=\"All Regions\",qtr4_2011,IF(region=$B$1,qtr4_2011))))","v":27598},{"$f":"SUM(IF(products=$A8,IF($B$1=\"All Regions\",qtr1_2012,IF(region=$B$1,qtr1_2012))))","v":27807},{"$f":"SUM(IF(products=$A8,IF($B$1=\"All Regions\",qtr2_2012,IF(region=$B$1,qtr2_2012))))","v":27671},{"$f":"SUM(IF(products=$A8,IF($B$1=\"All Regions\",qtr3_2012,IF(region=$B$1,qtr3_2012))))","v":27990},{"$f":"SUM(IF(products=$A8,IF($B$1=\"All Regions\",qtr4_2012,IF(region=$B$1,qtr4_2012))))","v":28015}]
["Powerhouse Laptop",{"$f":"SUM(IF(products=$A9,IF($B$1=\"All Regions\",qtr1_2011,IF(region=$B$1,qtr1_2011))))","v":28156},{"$f":"SUM(IF(products=$A9,IF($B$1=\"All Regions\",qtr2_2011,IF(region=$B$1,qtr2_2011))))","v":28360},{"$f":"SUM(IF(products=$A9,IF($B$1=\"All Regions\",qtr3_2011,IF(region=$B$1,qtr3_2011))))","v":27778},{"$f":"SUM(IF(products=$A9,IF($B$1=\"All Regions\",qtr4_2011,IF(region=$B$1,qtr4_2011))))","v":27129},{"$f":"SUM(IF(products=$A9,IF($B$1=\"All Regions\",qtr1_2012,IF(region=$B$1,qtr1_2012))))","v":28003},{"$f":"SUM(IF(products=$A9,IF($B$1=\"All Regions\",qtr2_2012,IF(region=$B$1,qtr2_2012))))","v":28645},{"$f":"SUM(IF(products=$A9,IF($B$1=\"All Regions\",qtr3_2012,IF(region=$B$1,qtr3_2012))))","v":28739},{"$f":"SUM(IF(products=$A9,IF($B$1=\"All Regions\",qtr4_2012,IF(region=$B$1,qtr4_2012))))","v":29290}]
["Series 5000 Tablet",{"$f":"SUM(IF(products=$A10,IF($B$1=\"All Regions\",qtr1_2011,IF(region=$B$1,qtr1_2011))))","v":27279},{"$f":"SUM(IF(products=$A10,IF($B$1=\"All Regions\",qtr2_2011,IF(region=$B$1,qtr2_2011))))","v":28699},{"$f":"SUM(IF(products=$A10,IF($B$1=\"All Regions\",qtr3_2011,IF(region=$B$1,qtr3_2011))))","v":28246},{"$f":"SUM(IF(products=$A10,IF($B$1=\"All Regions\",qtr4_2011,IF(region=$B$1,qtr4_2011))))","v":28629},{"$f":"SUM(IF(products=$A10,IF($B$1=\"All Regions\",qtr1_2012,IF(region=$B$1,qtr1_2012))))","v":28946},{"$f":"SUM(IF(products=$A10,IF($B$1=\"All Regions\",qtr2_2012,IF(region=$B$1,qtr2_2012))))","v":27847},{"$f":"SUM(IF(products=$A10,IF($B$1=\"All Regions\",qtr3_2012,IF(region=$B$1,qtr3_2012))))","v":28761},{"$f":"SUM(IF(products=$A10,IF($B$1=\"All Regions\",qtr4_2012,IF(region=$B$1,qtr4_2012))))","v":28018}]
["Series 8000 Tablet",{"$f":"SUM(IF(products=$A11,IF($B$1=\"All Regions\",qtr1_2011,IF(region=$B$1,qtr1_2011))))","v":27327},{"$f":"SUM(IF(products=$A11,IF($B$1=\"All Regions\",qtr2_2011,IF(region=$B$1,qtr2_2011))))","v":29706},{"$f":"SUM(IF(products=$A11,IF($B$1=\"All Regions\",qtr3_2011,IF(region=$B$1,qtr3_2011))))","v":28576},{"$f":"SUM(IF(products=$A11,IF($B$1=\"All Regions\",qtr4_2011,IF(region=$B$1,qtr4_2011))))","v":29282},{"$f":"SUM(IF(products=$A11,IF($B$1=\"All Regions\",qtr1_2012,IF(region=$B$1,qtr1_2012))))","v":29277},{"$f":"SUM(IF(products=$A11,IF($B$1=\"All Regions\",qtr2_2012,IF(region=$B$1,qtr2_2012))))","v":30149},{"$f":"SUM(IF(products=$A11,IF($B$1=\"All Regions\",qtr3_2012,IF(region=$B$1,qtr3_2012))))","v":28632},{"$f":"SUM(IF(products=$A11,IF($B$1=\"All Regions\",qtr4_2012,IF(region=$B$1,qtr4_2012))))","v":28564}]
["Thin Laptop",{"$f":"SUM(IF(products=$A12,IF($B$1=\"All Regions\",qtr1_2011,IF(region=$B$1,qtr1_2011))))","v":29658},{"$f":"SUM(IF(products=$A12,IF($B$1=\"All Regions\",qtr2_2011,IF(region=$B$1,qtr2_2011))))","v":29401},{"$f":"SUM(IF(products=$A12,IF($B$1=\"All Regions\",qtr3_2011,IF(region=$B$1,qtr3_2011))))","v":28389},{"$f":"SUM(IF(products=$A12,IF($B$1=\"All Regions\",qtr4_2011,IF(region=$B$1,qtr4_2011))))","v":29323},{"$f":"SUM(IF(products=$A12,IF($B$1=\"All Regions\",qtr1_2012,IF(region=$B$1,qtr1_2012))))","v":29466},{"$f":"SUM(IF(products=$A12,IF($B$1=\"All Regions\",qtr2_2012,IF(region=$B$1,qtr2_2012))))","v":29211},{"$f":"SUM(IF(products=$A12,IF($B$1=\"All Regions\",qtr3_2012,IF(region=$B$1,qtr3_2012))))","v":28906},{"$f":"SUM(IF(products=$A12,IF($B$1=\"All Regions\",qtr4_2012,IF(region=$B$1,qtr4_2012))))","v":30589}]
["Touchscreen Laptop",{"$f":"SUM(IF(products=$A13,IF($B$1=\"All Regions\",qtr1_2011,IF(region=$B$1,qtr1_2011))))","v":28712},{"$f":"SUM(IF(products=$A13,IF($B$1=\"All Regions\",qtr2_2011,IF(region=$B$1,qtr2_2011))))","v":29021},{"$f":"SUM(IF(products=$A13,IF($B$1=\"All Regions\",qtr3_2011,IF(region=$B$1,qtr3_2011))))","v":29393},{"$f":"SUM(IF(products=$A13,IF($B$1=\"All Regions\",qtr4_2011,IF(region=$B$1,qtr4_2011))))","v":30124},{"$f":"SUM(IF(products=$A13,IF($B$1=\"All Regions\",qtr1_2012,IF(region=$B$1,qtr1_2012))))","v":29638},{"$f":"SUM(IF(products=$A13,IF($B$1=\"All Regions\",qtr2_2012,IF(region=$B$1,qtr2_2012))))","v":27919},{"$f":"SUM(IF(products=$A13,IF($B$1=\"All Regions\",qtr3_2012,IF(region=$B$1,qtr3_2012))))","v":27642},{"$f":"SUM(IF(products=$A13,IF($B$1=\"All Regions\",qtr4_2012,IF(region=$B$1,qtr4_2012))))","v":28861}]
["Hybrid Laptop LED",{"$f":"SUM(IF(products=$A14,IF($B$1=\"All Regions\",qtr1_2011,IF(region=$B$1,qtr1_2011))))","v":27600},{"$f":"SUM(IF(products=$A14,IF($B$1=\"All Regions\",qtr2_2011,IF(region=$B$1,qtr2_2011))))","v":28764},{"$f":"SUM(IF(products=$A14,IF($B$1=\"All Regions\",qtr3_2011,IF(region=$B$1,qtr3_2011))))","v":27400},{"$f":"SUM(IF(products=$A14,IF($B$1=\"All Regions\",qtr4_2011,IF(region=$B$1,qtr4_2011))))","v":28149},{"$f":"SUM(IF(products=$A14,IF($B$1=\"All Regions\",qtr1_2012,IF(region=$B$1,qtr1_2012))))","v":28869},{"$f":"SUM(IF(products=$A14,IF($B$1=\"All Regions\",qtr2_2012,IF(region=$B$1,qtr2_2012))))","v":28151},{"$f":"SUM(IF(products=$A14,IF($B$1=\"All Regions\",qtr3_2012,IF(region=$B$1,qtr3_2012))))","v":27340},{"$f":"SUM(IF(products=$A14,IF($B$1=\"All Regions\",qtr4_2012,IF(region=$B$1,qtr4_2012))))","v":27880}]

{"sheet":"Sums","index":4,"n_rows":41,"n_cols":4,"rows_kept":41,"cut":false,"hidden":false,"merged":[]}
["Type","Description","Total Sales","Percent"]
["Product","All-in-one Desktop",{"$f":"SUM(IF(products=B2,totalsales))","v":228169},{"$f":"C2/SUM($C$2:$C$13)","v":8.302540260237401E-2}]
["Product","Economy Laptop",{"$f":"SUM(IF(products=B3,totalsales))","v":227889},{"$f":"C3/SUM($C$2:$C$13)","v":8.2923517102027042E-2}]
["Product","Elite Desktop",{"$f":"SUM(IF(products=B4,totalsales))","v":224001},8.1508764154352167E-2]
["Product","Elite Laptop",{"$f":"SUM(IF(products=B5,totalsales))","v":233702},8.5038732864587255E-2]
["Product","Gamer's Desktop",{"$f":"SUM(IF(products=B6,totalsales))","v":236103},8.591240103006241E-2]
["Product","Hybrid Laptop",{"$f":"SUM(IF(products=B7,totalsales))","v":223875},8.146291567919603E-2]
["Product","Powerhouse Laptop",{"$f":"SUM(IF(products=B8,totalsales))","v":226100},8.2272541530167387E-2]
["Product","Series 5000 Tablet",{"$f":"SUM(IF(products=B9,totalsales))","v":226425},8.2390801485927243E-2]
["Product","Series 8000 Tablet",{"$f":"SUM(IF(products=B10,totalsales))","v":231513},8.4242206577946233E-2]
["Product","Thin Laptop",{"$f":"SUM(IF(products=B11,totalsales))","v":234943},8.5490303957196451E-2]
["Product","Touchscreen Laptop",{"$f":"SUM(IF(products=B12,totalsales))","v":231310},8.416833959019468E-2]
["Product","Hybrid Laptop LED",{"$f":"SUM(IF(products=B13,totalsales))","v":224153},8.156407342596908E-2]
["Salesperson","Bo Kornegay",{"$f":"SUM(IF(salesperson=B14,totalsales))","v":224129},{"$f":"C14/SUM($C$2:$C$13)","v":8.1555340383082209E-2}]
["Salesperson","Britta Blakley",{"$f":"SUM(IF(salesperson=B15,totalsales))","v":234674}]
["Salesperson","Brock Stalder",{"$f":"SUM(IF(salesperson=B16,totalsales))","v":229290}]
["Salesperson","Catherine Shoaff",{"$f":"SUM(IF(salesperson=B17,totalsales))","v":225617}]
["Salesperson","Fermin Quin",{"$f":"SUM(IF(salesperson=B18,totalsales))","v":237110}]
["Salesperson","Glenda Harbaugh",{"$f":"SUM(IF(salesperson=B19,totalsales))","v":218346}]
["Salesperson","Jarrett Rimmer",{"$f":"SUM(IF(salesperson=B20,totalsales))","v":236950}]
["Salesperson","Li Bruni",{"$f":"SUM(IF(salesperson=B21,totalsales))","v":220798}]
["Salesperson","Linwood Camargo",{"$f":"SUM(IF(salesperson=B22,totalsales))","v":225304}]
["Salesperson","Norene McNeece",{"$f":"SUM(IF(salesperson=B23,totalsales))","v":235131}]
["Salesperson","Rick Boehm",{"$f":"SUM(IF(salesperson=B24,totalsales))","v":225552}]
["Salesperson","Sueann Olivero",{"$f":"SUM(IF(salesperson=B25,totalsales))","v":235282}]
["Region","Region 1",{"$f":"SUM(IF(region=B26,totalsales))","v":681285}]
["Region","Region 2",{"$f":"SUM(IF(region=B27,totalsales))","v":694345}]
["Region","Region 3",{"$f":"SUM(IF(region=B28,totalsales))","v":684280}]
["Region","Region 4",{"$f":"SUM(IF(region=B29,totalsales))","v":688273}]
["Customer Type","College Student",{"$f":"SUM(IF(customer_type=B30,totalsales))","v":224129}]
["Customer Type","Post Graduate Student",{"$f":"SUM(IF(customer_type=B31,totalsales))","v":234674}]
["Customer Type","Full-time Parent",{"$f":"SUM(IF(customer_type=B32,totalsales))","v":229290}]
["Customer Type","Self-Employed",{"$f":"SUM(IF(customer_type=B33,totalsales))","v":225617}]
["Customer Type","Full-time Employee",{"$f":"SUM(IF(customer_type=B34,totalsales))","v":237110}]
["Customer Type","Business Owner",{"$f":"SUM(IF(customer_type=B35,totalsales))","v":218346}]
["Customer Type","Maintstream Youth",{"$f":"SUM(IF(customer_type=B36,totalsales))","v":236950}]
["Customer Type","Retired",{"$f":"SUM(IF(customer_type=B37,totalsales))","v":220798}]
["Customer Type","Government",{"$f":"SUM(IF(customer_type=B38,totalsales))","v":225304}]
["Customer Type","Military",{"$f":"SUM(IF(customer_type=B39,totalsales))","v":235131}]
["Customer Type","Corporation",{"$f":"SUM(IF(customer_type=B40,totalsales))","v":225552}]
["Customer Type","NPO/NGO",{"$f":"SUM(IF(customer_type=B41,totalsales))","v":235282}]

{"sheet":"Financial Dashboard","index":5,"n_rows":504,"n_cols":14,"rows_kept":504,"cut":false,"hidden":true,"merged":[]}
["Customer","Industry","Region","Product","Estimated Revenue ($000)","Actual Revenue ($000)","Quarter","Year","Sales Rep","YQ","IYQ","RYQ","SYQ","PYQ"]
["Customer1","Consumer Goods","Europe","Product1",250,255,"Q4",2006,"Fritz Klein","2006Q4","Consumer Goods2006Q4","Europe2006Q4","Fritz Klein2006Q4","Product12006Q4"]
["Customer2","Consumer Goods","North America","Product2",200,319,"Q3",2008,"Porter Le","2008Q3","Consumer Goods2008Q3","North America2008Q3","Porter Le2008Q3","Product22008Q3"]
["Customer3","Services","Asia Pacific","Product1",600,123,"Q3",2006,"Oren Chase","2006Q3","Services2006Q3","Asia Pacific2006Q3","Oren Chase2006Q3","Product12006Q3"]
["Customer4","Finance","North America","Product2",400,272,"Q4",2008,"Porter Le","2008Q4","Finance2008Q4","North America2008Q4","Porter Le2008Q4","Product22008Q4"]
["Customer5","Consumer Goods","Europe","Product3",200,30,"Q2",2006,"Fritz Klein","2006Q2","Consumer Goods2006Q2","Europe2006Q2","Fritz Klein2006Q2","Product32006Q2"]
["Customer6","Services","North America","Product4",550,537,"Q1",2007,"Porter Le","2007Q1","Services2007Q1","North America2007Q1","Porter Le2007Q1","Product42007Q1"]
["Customer7","Technology","North America","Product4",650,89,"Q4",2005,"Porter Le","2005Q4","Technology2005Q4","North America2005Q4","Porter Le2005Q4","Product42005Q4"]
["Customer8","Consumer Goods","Europe","Product2",200,249,"Q4",2003,"Fritz Klein","2003Q4","Consumer Goods2003Q4","Europe2003Q4","Fritz Klein2003Q4","Product22003Q4"]
["Customer9","Healthcare","Asia Pacific","Product2",450,268,"Q4",2005,"Oren Chase","2005Q4","Healthcare2005Q4","Asia Pacific2005Q4","Oren Chase2005Q4","Product22005Q4"]
["Customer10","Consumer Goods","Europe","Product2",250,601,"Q2",2005,"Fritz Klein","2005Q2","Consumer Goods2005Q2","Europe2005Q2","Fritz Klein2005Q2","Product22005Q2"]
["Customer11","Utilities","South America","Product2",700,475,"Q4",2007,"Nasim Hanson","2007Q4","Utilities2007Q4","South America2007Q4","Nasim Hanson2007Q4","Product22007Q4"]
["Customer12","Technology","Europe","Product4",650,378,"Q3",2006,"Fritz Klein","2006Q3","Technology2006Q3","Europe2006Q3","Fritz Klein2006Q3","Product42006Q3"]
["Customer13","Materials","Europe","Product3",150,286,"Q4",2006,"Fritz Klein","2006Q4","Materials2006Q4","Europe2006Q4","Fritz Klein2006Q4","Product32006Q4"]
["Customer14","Materials","Middle East","Product4",150,158,"Q3",2006,"Bradley Valenzuela","2006Q3","Materials2006Q3","Middle East2006Q3","Bradley Valenzuela2006Q3","Product42006Q3"]
["Customer15","Materials","South America","Product3",100,390,"Q3",2004,"Nasim Hanson","2004Q3","Materials2004Q3","South America2004Q3","Nasim Hanson2004Q3","Product32004Q3"]
["Customer16","Consumer Goods","North America","Product1",300,291,"Q3",2004,"Porter Le","2004Q3","Consumer Goods2004Q3","North America2004Q3","Porter Le2004Q3","Product12004Q3"]
["Customer17","Materials","North America","Product4",100,764,"Q3",2008,"Porter Le","2008Q3","Materials2008Q3","North America2008Q3","Porter Le2008Q3","Product42008Q3"]
["Customer18","Finance","North America","Product2",400,415,"Q2",2007,"Porter Le","2007Q2","Finance2007Q2","North America2007Q2","Porter Le2007Q2","Product22007Q2"]
["Customer19","Services","Asia Pacific","Product2",600,702,"Q2",2005,"Oren Chase","2005Q2","Services2005Q2","Asia Pacific2005Q2","Oren Chase2005Q2","Product22005Q2"]
["Customer20","Services","North America","Product3",550,941,"Q2",2006,"Porter Le","2006Q2","Services2006Q2","North America2006Q2","Porter Le2006Q2","Product32006Q2"]
["Customer21","Utilities","South America","Product4",700,53,"Q1",2005,"Nasim Hanson","2005Q1","Utilities2005Q1","South America2005Q1","Nasim Hanson2005Q1","Product42005Q1"]
["Customer22","Finance","Europe","Product2",400,151,"Q3",2007,"Fritz Klein","2007Q3","Finance2007Q3","Europe2007Q3","Fritz Klein2007Q3","Product22007Q3"]
["Customer23","Healthcare","North America","Product4",500,953,"Q2",2003,"Porter Le","2003Q2","Healthcare2003Q2","North America2003Q2","Porter Le2003Q2","Product42003Q2"]
["Customer24","Technology","Asia Pacific","Product1",650,105,"Q2",2004,"Oren Chase","2004Q2","Technology2004Q2","Asia Pacific2004Q2","Oren Chase2004Q2","Product12004Q2"]
["Customer25","Technology","Europe","Entera CRM",650,87,"Q1",2006,"Fritz Klein","2006Q1","Technology2006Q1","Europe2006Q1","Fritz Klein2006Q1","Entera CRM2006Q1"]
["Customer26","Consumer Goods","Europe","Product1",200,987,"Q4",2008,"Fritz Klein","2008Q4","Consumer Goods2008Q4","Europe2008Q4","Fritz Klein2008Q4","Product12008Q4"]
["Customer27","Utilities","North America","Product4",700,81,"Q2",2007,"Porter Le","2007Q2","Utilities2007Q2","North America2007Q2","Porter Le2007Q2","Product42007Q2"]
["Customer28","Materials","Middle East","Product4",150,675,"Q1",2007,"Bradley Valenzuela","2007Q1","Materials2007Q1","Middle East2007Q1","Bradley Valenzuela2007Q1","Product42007Q1"]
["Customer29","Consumer Goods","Europe","Product2",250,616,"Q4",2007,"Fritz Klein","2007Q4","Consumer Goods2007Q4","Europe2007Q4","Fritz Klein2007Q4","Product22007Q4"]
["Customer30","Industrial Goods","Asia Pacific","Product3",550,856,"Q3",2006,"Oren Chase","2006Q3","Industrial Goods2006Q3","Asia Pacific2006Q3","Oren Chase2006Q3","Product32006Q3"]
["Customer31","Finance","Europe","Product1",400,617,"Q4",2006,"Fritz Klein","2006Q4","Finance2006Q4","Europe2006Q4","Fritz Klein2006Q4","Product12006Q4"]
["Customer32","Consumer Goods","Europe","Product1",300,852,"Q2",2008,"Fritz Klein","2008Q2","Consumer Goods2008Q2","Europe2008Q2","Fritz Klein2008Q2","Product12008Q2"]
["Customer33","Services","North America","Product2",600,765,"Q4",2007,"Porter Le","2007Q4","Services2007Q4","North America2007Q4","Porter Le2007Q4","Product22007Q4"]
["Customer34","Finance","North America","Entera CRM",300,958,"Q3",2004,"Porter Le","2004Q3","Finance2004Q3","North America2004Q3","Porter Le2004Q3","Entera CRM2004Q3"]
["Customer35","Finance","Europe","Product3",400,300,"Q2",2007,"Fritz Klein","2007Q2","Finance2007Q2","Europe2007Q2","Fritz Klein2007Q2","Product32007Q2"]
["Customer36","Technology","Europe","Entera CRM",650,84,"Q2",2008,"Fritz Klein","2008Q2","Technology2008Q2","Europe2008Q2","Fritz Klein2008Q2","Entera CRM2008Q2"]
["Customer37","Materials","Europe","Product3",150,83,"Q2",2008,"Fritz Klein","2008Q2","Materials2008Q2","Europe2008Q2","Fritz Klein2008Q2","Product32008Q2"]
["Customer38","Services","North America","Product2",600,756,"Q1",2007,"Porter Le","2007Q1","Services2007Q1","North America2007Q1","Porter Le2007Q1","Product22007Q1"]
["Customer39","Materials","Europe","Product4",100,887,"Q3",2007,"Fritz Klein","2007Q3","Materials2007Q3","Europe2007Q3","Fritz Klein2007Q3","Product42007Q3"]
["Customer40","Consumer Goods","Europe","Entera CRM",200,188,"Q3",2003,"Fritz Klein","2003Q3","Consumer Goods2003Q3","Europe2003Q3","Fritz Klein2003Q3","Entera CRM2003Q3"]
["Customer41","Materials","Asia Pacific","Product1",150,598,"Q3",2006,"Oren Chase","2006Q3","Materials2006Q3","Asia Pacific2006Q3","Oren Chase2006Q3","Product12006Q3"]
["Customer42","Materials","Middle East","Product1",150,64,"Q3",2007,"Bradley Valenzuela","2007Q3","Materials2007Q3","Middle East2007Q3","Bradley Valenzuela2007Q3","Product12007Q3"]
["Customer43","Utilities","South America","Product4",700,534,"Q4",2005,"Nasim Hanson","2005Q4","Utilities2005Q4","South America2005Q4","Nasim Hanson2005Q4","Product42005Q4"]
["Customer44","Materials","North America","Product4",100,160,"Q3",2003,"Porter Le","2003Q3","Materials2003Q3","North America2003Q3","Porter Le2003Q3","Product42003Q3"]
["Customer45","Services","North America","Product3",600,884,"Q1",2008,"Porter Le","2008Q1","Services2008Q1","North America2008Q1","Porter Le2008Q1","Product32008Q1"]
["Customer46","Materials","North America","Product1",100,828,"Q3",2004,"Porter Le","2004Q3","Materials2004Q3","North America2004Q3","Porter Le2004Q3","Product12004Q3"]
["Customer47","Technology","Europe","Entera CRM",650,81,"Q1",2003,"Fritz Klein","2003Q1","Technology2003Q1","Europe2003Q1","Fritz Klein2003Q1","Entera CRM2003Q1"]
["Customer48","Services","North America","Product2",600,835,"Q1",2008,"Porter Le","2008Q1","Services2008Q1","North America2008Q1","Porter Le2008Q1","Product22008Q1"]
["Customer49","Consumer Goods","Europe","Product1",250,810,"Q2",2004,"Fritz Klein","2004Q2","Consumer Goods2004Q2","Europe2004Q2","Fritz Klein2004Q2","Product12004Q2"]
["Customer50","Healthcare","Europe","Product1",500,536,"Q2",2006,"Fritz Klein","2006Q2","Healthcare2006Q2","Europe2006Q2","Fritz Klein2006Q2","Product12006Q2"]
["Customer51","Consumer Goods","Europe","Product3",200,476,"Q2",2005,"Fritz Klein","2005Q2","Consumer Goods2005Q2","Europe2005Q2","Fritz Klein2005Q2","Product32005Q2"]
["Customer52","Materials","South America","Product1",100,623,"Q2",2006,"Nasim Hanson","2006Q2","Materials2006Q2","South America2006Q2","Nasim Hanson2006Q2","Product12006Q2"]
["Customer53","Finance","Asia Pacific","Entera CRM",450,456,"Q3",2003,"Oren Chase","2003Q3","Finance2003Q3","Asia Pacific2003Q3","Oren Chase2003Q3","Entera CRM2003Q3"]
["Customer54","Finance","Europe","Product3",400,450,"Q1",2005,"Fritz Klein","2005Q1","Finance2005Q1","Europe2005Q1","Fritz Klein2005Q1","Product32005Q1"]
["Customer55","Technology","Europe","Product3",650,830,"Q3",2005,"Fritz Klein","2005Q3","Technology2005Q3","Europe2005Q3","Fritz Klein2005Q3","Product32005Q3"]
["Customer56","Finance","North America","Product4",300,252,"Q1",2005,"Porter Le","2005Q1","Finance2005Q1","North America2005Q1","Porter Le2005Q1","Product42005Q1"]
["Customer57","Finance","North America","Product4",350,863,"Q4",2006,"Porter Le","2006Q4","Finance2006Q4","North America2006Q4","Porter Le2006Q4","Product42006Q4"]
["Customer58","Technology","Asia Pacific","Product4",650,769,"Q2",2003,"Oren Chase","2003Q2","Technology2003Q2","Asia Pacific2003Q2","Oren Chase2003Q2","Product42003Q2"]
["Customer59","Consumer Goods","North America","Product3",300,585,"Q2",2008,"Porter Le","2008Q2","Consumer Goods2008Q2","North America2008Q2","Porter Le2008Q2","Product32008Q2"]
["Customer60","Consumer Goods","Europe","Product2",250,436,"Q2",2006,"Fritz Klein","2006Q2","Consumer Goods2006Q2","Europe2006Q2","Fritz Klein2006Q2","Product22006Q2"]
["Customer61","Healthcare","South America","Product3",450,161,"Q1",2008,"Nasim Hanson","2008Q1","Healthcare2008Q1","South America2008Q1","Nasim Hanson2008Q1","Product32008Q1"]
["Customer62","Consumer Goods","Europe","Product3",300,801,"Q2",2006,"Fritz Klein","2006Q2","Consumer Goods2006Q2","Europe2006Q2","Fritz Klein2006Q2","Product32006Q2"]
["Customer63","Finance","Europe","Entera CRM",400,156,"Q3",2003,"Fritz Klein","2003Q3","Finance2003Q3","Europe2003Q3","Fritz Klein2003Q3","Entera CRM2003Q3"]
["Customer64","Finance","Europe","Product3",400,32,"Q4",2007,"Fritz Klein","2007Q4","Finance2007Q4","Europe2007Q4","Fritz Klein2007Q4","Product32007Q4"]
["Customer65","Industrial Goods","Asia Pacific","Product3",500,122,"Q3",2003,"Oren Chase","2003Q3","Industrial Goods2003Q3","Asia Pacific2003Q3","Oren Chase2003Q3","Product32003Q3"]
["Customer66","Consumer Goods","Asia Pacific","Product3",250,732,"Q4",2006,"Oren Chase","2006Q4","Consumer Goods2006Q4","Asia Pacific2006Q4","Oren Chase2006Q4","Product32006Q4"]
["Customer67","Consumer Goods","Europe","Entera CRM",200,344,"Q4",2006,"Fritz Klein","2006Q4","Consumer Goods2006Q4","Europe2006Q4","Fritz Klein2006Q4","Entera CRM2006Q4"]
["Customer68","Utilities","North America","Product1",700,974,"Q1",2006,"Porter Le","2006Q1","Utilities2006Q1","North America2006Q1","Porter Le2006Q1","Product12006Q1"]
["Customer69","Healthcare","Europe","Entera CRM",500,929,"Q1",2003,"Fritz Klein","2003Q1","Healthcare2003Q1","Europe2003Q1","Fritz Klein2003Q1","Entera CRM2003Q1"]
["Customer70","Services","North America","Product1",600,389,"Q3",2004,"Porter Le","2004Q3","Services2004Q3","North America2004Q3","Porter Le2004Q3","Product12004Q3"]
["Customer71","Finance","North America","Product3",350,409,"Q2",2004,"Porter Le","2004Q2","Finance2004Q2","North America2004Q2","Porter Le2004Q2","Product32004Q2"]
["Customer72","Consumer Goods","Europe","Entera CRM",250,907,"Q1",2003,"Fritz Klein","2003Q1","Consumer Goods2003Q1","Europe2003Q1","Fritz Klein2003Q1","Entera CRM2003Q1"]
["Customer73","Materials","South America","Product2",100,928,"Q2",2005,"Nasim Hanson","2005Q2","Materials2005Q2","South America2005Q2","Nasim Hanson2005Q2","Product22005Q2"]
["Customer74","Industrial Goods","Asia Pacific","Product2",550,928,"Q3",2003,"Oren Chase","2003Q3","Industrial Goods2003Q3","Asia Pacific2003Q3","Oren Chase2003Q3","Product22003Q3"]
["Customer75","Materials","North America","Product2",100,271,"Q4",2007,"Porter Le","2007Q4","Materials2007Q4","North America2007Q4","Porter Le2007Q4","Product22007Q4"]
["Customer76","Healthcare","North America","Product3",500,468,"Q1",2007,"Porter Le","2007Q1","Healthcare2007Q1","North America2007Q1","Porter Le2007Q1","Product32007Q1"]
["Customer77","Finance","North America","Entera CRM",350,913,"Q3",2005,"Porter Le","2005Q3","Finance2005Q3","North America2005Q3","Porter Le2005Q3","Entera CRM2005Q3"]
["Customer78","Utilities","South America","Product1",700,438,"Q3",2005,"Nasim Hanson","2005Q3","Utilities2005Q3","South America2005Q3","Nasim Hanson2005Q3","Product12005Q3"]
["Customer79","Services","North America","Entera CRM",600,871,"Q4",2007,"Porter Le","2007Q4","Services2007Q4","North America2007Q4","Porter Le2007Q4","Entera CRM2007Q4"]
["Customer80","Materials","Asia Pacific","Entera CRM",150,969,"Q4",2004,"Oren Chase","2004Q4","Materials2004Q4","Asia Pacific2004Q4","Oren Chase2004Q4","Entera CRM2004Q4"]
["Customer81","Consumer Goods","Europe","Product4",250,959,"Q1",2007,"Fritz Klein","2007Q1","Consumer Goods2007Q1","Europe2007Q1","Fritz Klein2007Q1","Product42007Q1"]
["Customer82","Finance","North America","Product2",350,123,"Q1",2007,"Porter Le","2007Q1","Finance2007Q1","North America2007Q1","Porter Le2007Q1","Product22007Q1"]
["Customer83","Finance","Europe","Product3",350,714,"Q1",2004,"Fritz Klein","2004Q1","Finance2004Q1","Europe2004Q1","Fritz Klein2004Q1","Product32004Q1"]
["Customer84","Healthcare","North America","Product2",500,153,"Q2",2005,"Porter Le","2005Q2","Healthcare2005Q2","North America2005Q2","Porter Le2005Q2","Product22005Q2"]
["Customer85","Finance","North America","Product2",300,596,"Q3",2003,"Porter Le","2003Q3","Finance2003Q3","North America2003Q3","Porter Le2003Q3","Product22003Q3"]
["Customer86","Consumer Goods","North America","Product3",200,371,"Q3",2006,"Porter Le","2006Q3","Consumer Goods2006Q3","North America2006Q3","Porter Le2006Q3","Product32006Q3"]
["Customer87","Services","Asia Pacific","Product2",600,773,"Q4",2008,"Oren Chase","2008Q4","Services2008Q4","Asia Pacific2008Q4","Oren Chase2008Q4","Product22008Q4"]
["Customer88","Consumer Goods","Europe","Product3",200,828,"Q4",2008,"Fritz Klein","2008Q4","Consumer Goods2008Q4","Europe2008Q4","Fritz Klein2008Q4","Product32008Q4"]
["Customer89","Industrial Goods","Asia Pacific","Product1",500,877,"Q2",2003,"Oren Chase","2003Q2","Industrial Goods2003Q2","Asia Pacific2003Q2","Oren Chase2003Q2","Product12003Q2"]
["Customer90","Healthcare","North America","Entera CRM",500,228,"Q1",2003,"Porter Le","2003Q1","Healthcare2003Q1","North America2003Q1","Porter Le2003Q1","Entera CRM2003Q1"]
["Customer91","Healthcare","Europe","Product4",500,651,"Q4",2003,"Fritz Klein","2003Q4","Healthcare2003Q4","Europe2003Q4","Fritz Klein2003Q4","Product42003Q4"]
["Customer92","Finance","North America","Product1",400,718,"Q4",2004,"Porter Le","2004Q4","Finance2004Q4","North America2004Q4","Porter Le2004Q4","Product12004Q4"]
["Customer93","Services","North America","Product2",600,778,"Q4",2005,"Porter Le","2005Q4","Services2005Q4","North America2005Q4","Porter Le2005Q4","Product22005Q4"]
["Customer94","Utilities","North America","Entera CRM",700,461,"Q2",2005,"Porter Le","2005Q2","Utilities2005Q2","North America2005Q2","Porter Le2005Q2","Entera CRM2005Q2"]
["Customer95","Technology","Europe","Product3",650,49,"Q4",2005,"Fritz Klein","2005Q4","Technology2005Q4","Europe2005Q4","Fritz Klein2005Q4","Product32005Q4"]
["Customer96","Healthcare","North America","Product4",500,576,"Q3",2005,"Porter Le","2005Q3","Healthcare2005Q3","North America2005Q3","Porter Le2005Q3","Product42005Q3"]
["Customer97","Consumer Goods","Europe","Product4",200,579,"Q4",2006,"Fritz Klein","2006Q4","Consumer Goods2006Q4","Europe2006Q4","Fritz Klein2006Q4","Product42006Q4"]
["Customer98","Services","Asia Pacific","Entera CRM",600,449,"Q1",2003,"Oren Chase","2003Q1","Services2003Q1","Asia Pacific2003Q1","Oren Chase2003Q1","Entera CRM2003Q1"]
["Customer99","Finance","North America","Product2",350,516,"Q2",2003,"Porter Le","2003Q2","Finance2003Q2","North America2003Q2","Porter Le2003Q2","Product22003Q2"]
["Customer100","Materials","South America","Entera CRM",100,456,"Q4",2007,"Nasim Hanson","2007Q4","Materials2007Q4","South America2007Q4","Nasim Hanson2007Q4","Entera CRM2007Q4"]
["Customer101","Healthcare","North America","Product3",500,959,"Q2",2008,"Porter Le","2008Q2","Healthcare2008Q2","North America2008Q2","Porter Le2008Q2","Product32008Q2"]
["Customer102","Technology","Asia Pacific","Entera CRM",700,179,"Q4",2005,"Oren Chase","2005Q4","Technology2005Q4","Asia Pacific2005Q4","Oren Chase2005Q4","Entera CRM2005Q4"]
["Customer103","Finance","North America","Product2",300,848,"Q4",2003,"Porter Le","2003Q4","Finance2003Q4","North America2003Q4","Porter Le2003Q4","Product22003Q4"]
["Customer104","Consumer Goods","Asia Pacific","Product1",250,431,"Q1",2005,"Oren Chase","2005Q1","Consumer Goods2005Q1","Asia Pacific2005Q1","Oren Chase2005Q1","Product12005Q1"]
["Customer105","Finance","North America","Entera CRM",400,86,"Q4",2007,"Porter Le","2007Q4","Finance2007Q4","North America2007Q4","Porter Le2007Q4","Entera CRM2007Q4"]
["Customer106","Materials","Asia Pacific","Entera CRM",150,606,"Q4",2008,"Oren Chase","2008Q4","Materials2008Q4","Asia Pacific2008Q4","Oren Chase2008Q4","Entera CRM2008Q4"]
["Customer107","Consumer Goods","Europe","Product3",200,871,"Q3",2008,"Fritz Klein","2008Q3","Consumer Goods2008Q3","Europe2008Q3","Fritz Klein2008Q3","Product32008Q3"]
["Customer108","Healthcare","Europe","Product1",500,974,"Q2",2003,"Fritz Klein","2003Q2","Healthcare2003Q2","Europe2003Q2","Fritz Klein2003Q2","Product12003Q2"]
["Customer109","Consumer Goods","Europe","Product4",250,874,"Q4",2006,"Fritz Klein","2006Q4","Consumer Goods2006Q4","Europe2006Q4","Fritz Klein2006Q4","Product42006Q4"]
["Customer110","Healthcare","North America","Product4",500,362,"Q1",2007,"Porter Le","2007Q1","Healthcare2007Q1","North America2007Q1","Porter Le2007Q1","Product42007Q1"]
["Customer111","Consumer Goods","Europe","Entera CRM",250,848,"Q1",2007,"Fritz Klein","2007Q1","Consumer Goods2007Q1","Europe2007Q1","Fritz Klein2007Q1","Entera CRM2007Q1"]
["Customer112","Healthcare","North America","Product2",500,681,"Q2",2004,"Porter Le","2004Q2","Healthcare2004Q2","North America2004Q2","Porter Le2004Q2","Product22004Q2"]
["Customer113","Technology","Asia Pacific","Entera CRM",650,281,"Q3",2008,"Oren Chase","2008Q3","Technology2008Q3","Asia Pacific2008Q3","Oren Chase2008Q3","Entera CRM2008Q3"]
["Customer114","Healthcare","North America","Product1",500,487,"Q4",2003,"Porter Le","2003Q4","Healthcare2003Q4","North America2003Q4","Porter Le2003Q4","Product12003Q4"]
["Customer115","Services","Asia Pacific","Product1",600,491,"Q1",2006,"Oren Chase","2006Q1","Services2006Q1","Asia Pacific2006Q1","Oren Chase2006Q1","Product12006Q1"]
["Customer116","Healthcare","Asia Pacific","Product1",450,640,"Q4",2006,"Oren Chase","2006Q4","Healthcare2006Q4","Asia Pacific2006Q4","Oren Chase2006Q4","Product12006Q4"]
["Customer117","Consumer Goods","Asia Pacific","Entera CRM",250,892,"Q4",2008,"Oren Chase","2008Q4","Consumer Goods2008Q4","Asia Pacific2008Q4","Oren Chase2008Q4","Entera CRM2008Q4"]
["Customer118","Finance","North America","Product4",400,495,"Q4",2003,"Porter Le","2003Q4","Finance2003Q4","North America2003Q4","Porter Le2003Q4","Product42003Q4"]
["Customer119","Consumer Goods","Europe","Product4",200,984,"Q2",2006,"Fritz Klein","2006Q2","Consumer Goods2006Q2","Europe2006Q2","Fritz Klein2006Q2","Product42006Q2"]
["Customer120","Consumer Goods","Asia Pacific","Product4",250,719,"Q2",2005,"Oren Chase","2005Q2","Consumer Goods2005Q2","Asia Pacific2005Q2","Oren Chase2005Q2","Product42005Q2"]
["Customer121","Finance","North America","Product1",400,173,"Q4",2006,"Porter Le","2006Q4","Finance2006Q4","North America2006Q4","Porter Le2006Q4","Product12006Q4"]
["Customer122","Healthcare","North America","Product2",500,998,"Q4",2004,"Porter Le","2004Q4","Healthcare2004Q4","North America2004Q4","Porter Le2004Q4","Product22004Q4"]
["Customer123","Finance","Europe","Product4",350,358,"Q4",2008,"Fritz Klein","2008Q4","Finance2008Q4","Europe2008Q4","Fritz Klein2008Q4","Product42008Q4"]
["Customer124","Consumer Goods","Asia Pacific","Entera CRM",250,551,"Q4",2005,"Oren Chase","2005Q4","Consumer Goods2005Q4","Asia Pacific2005Q4","Oren Chase2005Q4","Entera CRM2005Q4"]
["Customer125","Consumer Goods","Europe","Product4",250,948,"Q3",2003,"Fritz Klein","2003Q3","Consumer Goods2003Q3","Europe2003Q3","Fritz Klein2003Q3","Product42003Q3"]
["Customer126","Finance","North America","Product4",350,122,"Q3",2007,"Porter Le","2007Q3","Finance2007Q3","North America2007Q3","Porter Le2007Q3","Product42007Q3"]
["Customer127","Healthcare","Asia Pacific","Product1",450,731,"Q4",2005,"Oren Chase","2005Q4","Healthcare2005Q4","Asia Pacific2005Q4","Oren Chase2005Q4","Product12005Q4"]
["Customer128","Materials","South America","Product1",100,95,"Q1",2003,"Nasim Hanson","2003Q1","Materials2003Q1","South America2003Q1","Nasim Hanson2003Q1","Product12003Q1"]
["Customer129","Consumer Goods","North America","Product4",300,602,"Q3",2004,"Porter Le","2004Q3","Consumer Goods2004Q3","North America2004Q3","Porter Le2004Q3","Product42004Q3"]
["Customer130","Healthcare","South America","Entera CRM",500,171,"Q1",2007,"Nasim Hanson","2007Q1","Healthcare2007Q1","South America2007Q1","Nasim Hanson2007Q1","Entera CRM2007Q1"]
["Customer131","Consumer Goods","North America","Product2",200,415,"Q3",2003,"Porter Le","2003Q3","Consumer Goods2003Q3","North America2003Q3","Porter Le2003Q3","Product22003Q3"]
["Customer132","Consumer Goods","Asia Pacific","Product1",250,254,"Q3",2004,"Oren Chase","2004Q3","Consumer Goods2004Q3","Asia Pacific2004Q3","Oren Chase2004Q3","Product12004Q3"]
["Customer133","Consumer Goods","North America","Product3",300,454,"Q3",2003,"Porter Le","2003Q3","Consumer Goods2003Q3","North America2003Q3","Porter Le2003Q3","Product32003Q3"]
["Customer134","Finance","Europe","Product2",400,511,"Q3",2005,"Fritz Klein","2005Q3","Finance2005Q3","Europe2005Q3","Fritz Klein2005Q3","Product22005Q3"]
["Customer135","Finance","North America","Entera CRM",350,316,"Q3",2005,"Porter Le","2005Q3","Finance2005Q3","North America2005Q3","Porter Le2005Q3","Entera CRM2005Q3"]
["Customer136","Technology","Asia Pacific","Product1",650,838,"Q2",2004,"Oren Chase","2004Q2","Technology2004Q2","Asia Pacific2004Q2","Oren Chase2004Q2","Product12004Q2"]
["Customer137","Healthcare","South America","Product4",450,804,"Q3",2007,"Nasim Hanson","2007Q3","Healthcare2007Q3","South America2007Q3","Nasim Hanson2007Q3","Product42007Q3"]
["Customer138","Consumer Goods","North America","Product4",300,881,"Q3",2006,"Porter Le","2006Q3","Consumer Goods2006Q3","North America2006Q3","Porter Le2006Q3","Product42006Q3"]
["Customer139","Materials","North America","Product1",100,111,"Q2",2003,"Porter Le","2003Q2","Materials2003Q2","North America2003Q2","Porter Le2003Q2","Product12003Q2"]
["Customer140","Finance","Europe","Product3",350,651,"Q3",2008,"Fritz Klein","2008Q3","Finance2008Q3","Europe2008Q3","Fritz Klein2008Q3","Product32008Q3"]
["Customer141","Consumer Goods","Europe","Product4",250,925,"Q1",2003,"Fritz Klein","2003Q1","Consumer Goods2003Q1","Europe2003Q1","Fritz Klein2003Q1","Product42003Q1"]
["Customer142","Technology","Europe","Entera CRM",650,183,"Q4",2003,"Fritz Klein","2003Q4","Technology2003Q4","Europe2003Q4","Fritz Klein2003Q4","Entera CRM2003Q4"]
["Customer143","Materials","South America","Entera CRM",100,590,"Q2",2007,"Nasim Hanson","2007Q2","Materials2007Q2","South America2007Q2","Nasim Hanson2007Q2","Entera CRM2007Q2"]
["Customer144","Finance","Europe","Entera CRM",350,951,"Q2",2007,"Fritz Klein","2007Q2","Finance2007Q2","Europe2007Q2","Fritz Klein2007Q2","Entera CRM2007Q2"]
["Customer145","Services","North America","Entera CRM",550,694,"Q3",2008,"Porter Le","2008Q3","Services2008Q3","North America2008Q3","Porter Le2008Q3","Entera CRM2008Q3"]
["Customer146","Services","North America","Product3",550,235,"Q3",2006,"Porter Le","2006Q3","Services2006Q3","North America2006Q3","Porter Le2006Q3","Product32006Q3"]
["Customer147","Consumer Goods","Europe","Product3",250,622,"Q2",2003,"Fritz Klein","2003Q2","Consumer Goods2003Q2","Europe2003Q2","Fritz Klein2003Q2","Product32003Q2"]
["Customer148","Finance","North America","Product2",350,237,"Q2",2008,"Porter Le","2008Q2","Finance2008Q2","North America2008Q2","Porter Le2008Q2","Product22008Q2"]
["Customer149","Finance","North America","Product2",300,98,"Q1",2003,"Porter Le","2003Q1","Finance2003Q1","North America2003Q1","Porter Le2003Q1","Product22003Q1"]
["Customer150","Services","North America","Product4",550,868,"Q4",2003,"Porter Le","2003Q4","Services2003Q4","North America2003Q4","Porter Le2003Q4","Product42003Q4"]
["Customer151","Materials","North America","Product1",100,77,"Q2",2006,"Porter Le","2006Q2","Materials2006Q2","North America2006Q2","Porter Le2006Q2","Product12006Q2"]
["Customer152","Materials","Middle East","Product1",150,420,"Q3",2004,"Bradley Valenzuela","2004Q3","Materials2004Q3","Middle East2004Q3","Bradley Valenzuela2004Q3","Product12004Q3"]
["Customer153","Materials","South America","Product1",100,949,"Q1",2003,"Nasim Hanson","2003Q1","Materials2003Q1","South America2003Q1","Nasim Hanson2003Q1","Product12003Q1"]
["Customer154","Consumer Goods","Asia Pacific","Product3",250,930,"Q3",2005,"Oren Chase","2005Q3","Consumer Goods2005Q3","Asia Pacific2005Q3","Oren Chase2005Q3","Product32005Q3"]
["Customer155","Finance","North America","Product2",300,242,"Q1",2003,"Porter Le","2003Q1","Finance2003Q1","North America2003Q1","Porter Le2003Q1","Product22003Q1"]
["Customer156","Utilities","North America","Product1",700,273,"Q2",2005,"Porter Le","2005Q2","Utilities2005Q2","North America2005Q2","Porter Le2005Q2","Product12005Q2"]
["Customer157","Finance","Europe","Entera CRM",400,161,"Q2",2005,"Fritz Klein","2005Q2","Finance2005Q2","Europe2005Q2","Fritz Klein2005Q2","Entera CRM2005Q2"]
["Customer158","Finance","North America","Product1",400,152,"Q4",2005,"Porter Le","2005Q4","Finance2005Q4","North America2005Q4","Porter Le2005Q4","Product12005Q4"]
["Customer159","Finance","Europe","Product3",350,700,"Q3",2008,"Fritz Klein","2008Q3","Finance2008Q3","Europe2008Q3","Fritz Klein2008Q3","Product32008Q3"]
["Customer160","Consumer Goods","North America","Product2",300,633,"Q3",2006,"Porter Le","2006Q3","Consumer Goods2006Q3","North America2006Q3","Porter Le2006Q3","Product22006Q3"]
["Customer161","Materials","South America","Product4",100,670,"Q3",2003,"Nasim Hanson","2003Q3","Materials2003Q3","South America2003Q3","Nasim Hanson2003Q3","Product42003Q3"]
["Customer162","Technology","North America","Product1",650,918,"Q4",2004,"Porter Le","2004Q4","Technology2004Q4","North America2004Q4","Porter Le2004Q4","Product12004Q4"]
["Customer163","Healthcare","North America","Entera CRM",500,287,"Q1",2005,"Porter Le","2005Q1","Healthcare2005Q1","North America2005Q1","Porter Le2005Q1","Entera CRM2005Q1"]
["Customer164","Services","Asia Pacific","Product1",600,24,"Q3",2003,"Oren Chase","2003Q3","Services2003Q3","Asia Pacific2003Q3","Oren Chase2003Q3","Product12003Q3"]
["Customer165","Materials","Asia Pacific","Product1",150,620,"Q3",2008,"Oren Chase","2008Q3","Materials2008Q3","Asia Pacific2008Q3","Oren Chase2008Q3","Product12008Q3"]
["Customer166","Services","Asia Pacific","Product3",600,334,"Q2",2005,"Oren Chase","2005Q2","Services2005Q2","Asia Pacific2005Q2","Oren Chase2005Q2","Product32005Q2"]
["Customer167","Healthcare","Asia Pacific","Product3",450,920,"Q4",2005,"Oren Chase","2005Q4","Healthcare2005Q4","Asia Pacific2005Q4","Oren Chase2005Q4","Product32005Q4"]
["Customer168","Finance","Asia Pacific","Product1",450,255,"Q4",2003,"Oren Chase","2003Q4","Finance2003Q4","Asia Pacific2003Q4","Oren Chase2003Q4","Product12003Q4"]
["Customer169","Consumer Goods","North America","Product1",300,525,"Q4",2005,"Porter Le","2005Q4","Consumer Goods2005Q4","North America2005Q4","Porter Le2005Q4","Product12005Q4"]
["Customer170","Healthcare","Asia Pacific","Product4",450,897,"Q2",2007,"Oren Chase","2007Q2","Healthcare2007Q2","Asia Pacific2007Q2","Oren Chase2007Q2","Product42007Q2"]
["Customer171","Consumer Goods","Europe","Entera CRM",200,973,"Q1",2003,"Fritz Klein","2003Q1","Consumer Goods2003Q1","Europe2003Q1","Fritz Klein2003Q1","Entera CRM2003Q1"]
["Customer172","Finance","North America","Product2",350,530,"Q4",2004,"Porter Le","2004Q4","Finance2004Q4","North America2004Q4","Porter Le2004Q4","Product22004Q4"]
["Customer173","Consumer Goods","Europe","Product1",250,985,"Q2",2007,"Fritz Klein","2007Q2","Consumer Goods2007Q2","Europe2007Q2","Fritz Klein2007Q2","Product12007Q2"]
["Customer174","Consumer Goods","Asia Pacific","Product4",250,193,"Q2",2006,"Oren Chase","2006Q2","Consumer Goods2006Q2","Asia Pacific2006Q2","Oren Chase2006Q2","Product42006Q2"]
["Customer175","Materials","South America","Product1",100,201,"Q1",2006,"Nasim Hanson","2006Q1","Materials2006Q1","South America2006Q1","Nasim Hanson2006Q1","Product12006Q1"]
["Customer176","Consumer Goods","Asia Pacific","Product4",250,929,"Q4",2004,"Oren Chase","2004Q4","Consumer Goods2004Q4","Asia Pacific2004Q4","Oren Chase2004Q4","Product42004Q4"]
["Customer177","Services","North America","Product1",550,442,"Q4",2005,"Porter Le","2005Q4","Services2005Q4","North America2005Q4","Porter Le2005Q4","Product12005Q4"]
["Customer178","Healthcare","North America","Product1",500,62,"Q4",2003,"Porter Le","2003Q4","Healthcare2003Q4","North America2003Q4","Porter Le2003Q4","Product12003Q4"]
["Customer179","Finance","North America","Product4",300,731,"Q4",2003,"Porter Le","2003Q4","Finance2003Q4","North America2003Q4","Porter Le2003Q4","Product42003Q4"]
["Customer180","Healthcare","Asia Pacific","Product2",450,62,"Q2",2008,"Oren Chase","2008Q2","Healthcare2008Q2","Asia Pacific2008Q2","Oren Chase2008Q2","Product22008Q2"]
["Customer181","Services","North America","Product2",550,190,"Q4",2003,"Porter Le","2003Q4","Services2003Q4","North America2003Q4","Porter Le2003Q4","Product22003Q4"]
["Customer182","Technology","North America","Product1",650,159,"Q1",2007,"Porter Le","2007Q1","Technology2007Q1","North America2007Q1","Porter Le2007Q1","Product12007Q1"]
["Customer183","Technology","Europe","Product2",650,263,"Q4",2006,"Fritz Klein","2006Q4","Technology2006Q4","Europe2006Q4","Fritz Klein2006Q4","Product22006Q4"]
["Customer184","Finance","Europe","Product4",350,284,"Q4",2006,"Fritz Klein","2006Q4","Finance2006Q4","Europe2006Q4","Fritz Klein2006Q4","Product42006Q4"]
["Customer185","Finance","North America","Product3",300,865,"Q4",2003,"Porter Le","2003Q4","Finance2003Q4","North America2003Q4","Porter Le2003Q4","Product32003Q4"]
["Customer186","Materials","North America","Product4",100,517,"Q4",2003,"Porter Le","2003Q4","Materials2003Q4","North America2003Q4","Porter Le2003Q4","Product42003Q4"]
["Customer187","Services","North America","Product4",550,166,"Q3",2004,"Porter Le","2004Q3","Services2004Q3","North America2004Q3","Porter Le2004Q3","Product42004Q3"]
["Customer188","Materials","South America","Product1",100,371,"Q3",2003,"Nasim Hanson","2003Q3","Materials2003Q3","South America2003Q3","Nasim Hanson2003Q3","Product12003Q3"]
["Customer189","Materials","Middle East","Product3",150,533,"Q4",2004,"Bradley Valenzuela","2004Q4","Materials2004Q4","Middle East2004Q4","Bradley Valenzuela2004Q4","Product32004Q4"]
["Customer190","Healthcare","South America","Entera CRM",500,223,"Q4",2008,"Nasim Hanson","2008Q4","Healthcare2008Q4","South America2008Q4","Nasim Hanson2008Q4","Entera CRM2008Q4"]
["Customer191","Consumer Goods","Europe","Product3",200,74,"Q4",2006,"Fritz Klein","2006Q4","Consumer Goods2006Q4","Europe2006Q4","Fritz Klein2006Q4","Product32006Q4"]
["Customer192","Finance","Europe","Entera CRM",400,157,"Q4",2006,"Fritz Klein","2006Q4","Finance2006Q4","Europe2006Q4","Fritz Klein2006Q4","Entera CRM2006Q4"]
["Customer193","Technology","North America","Entera CRM",650,655,"Q2",2007,"Porter Le","2007Q2","Technology2007Q2","North America2007Q2","Porter Le2007Q2","Entera CRM2007Q2"]
["Customer194","Services","North America","Entera CRM",550,305,"Q3",2004,"Porter Le","2004Q3","Services2004Q3","North America2004Q3","Porter Le2004Q3","Entera CRM2004Q3"]
["Customer195","Services","North America","Product1",550,694,"Q3",2007,"Porter Le","2007Q3","Services2007Q3","North America2007Q3","Porter Le2007Q3","Product12007Q3"]
["Customer196","Materials","South America","Product2",100,835,"Q1",2004,"Nasim Hanson","2004Q1","Materials2004Q1","South America2004Q1","Nasim Hanson2004Q1","Product22004Q1"]
["Customer197","Consumer Goods","Europe","Product1",250,832,"Q4",2006,"Fritz Klein","2006Q4","Consumer Goods2006Q4","Europe2006Q4","Fritz Klein2006Q4","Product12006Q4"]
["Customer198","Finance","Europe","Product2",350,272,"Q2",2007,"Fritz Klein","2007Q2","Finance2007Q2","Europe2007Q2","Fritz Klein2007Q2","Product22007Q2"]
["Customer199","Consumer Goods","Europe","Product4",200,776,"Q1",2005,"Fritz Klein","2005Q1","Consumer Goods2005Q1","Europe2005Q1","Fritz Klein2005Q1","Product42005Q1"]
["Customer200","Materials","South America","Product2",100,208,"Q3",2003,"Nasim Hanson","2003Q3","Materials2003Q3","South America2003Q3","Nasim Hanson2003Q3","Product22003Q3"]
["Customer201","Finance","Europe","Product2",350,36,"Q4",2003,"Fritz Klein","2003Q4","Finance2003Q4","Europe2003Q4","Fritz Klein2003Q4","Product22003Q4"]
["Customer202","Consumer Goods","Asia Pacific","Entera CRM",250,816,"Q3",2004,"Oren Chase","2004Q3","Consumer Goods2004Q3","Asia Pacific2004Q3","Oren Chase2004Q3","Entera CRM2004Q3"]
["Customer203","Consumer Goods","Europe","Entera CRM",250,680,"Q3",2008,"Fritz Klein","2008Q3","Consumer Goods2008Q3","Europe2008Q3","Fritz Klein2008Q3","Entera CRM2008Q3"]
["Customer204","Services","North America","Product4",600,963,"Q4",2006,"Porter Le","2006Q4","Services2006Q4","North America2006Q4","Porter Le2006Q4","Product42006Q4"]
["Customer205","Industrial Goods","Asia Pacific","Entera CRM",550,369,"Q2",2005,"Oren Chase","2005Q2","Industrial Goods2005Q2","Asia Pacific2005Q2","Oren Chase2005Q2","Entera CRM2005Q2"]
["Customer206","Materials","Middle East","Product1",150,847,"Q4",2008,"Bradley Valenzuela","2008Q4","Materials2008Q4","Middle East2008Q4","Bradley Valenzuela2008Q4","Product12008Q4"]
["Customer207","Healthcare","Asia Pacific","Entera CRM",450,476,"Q4",2003,"Oren Chase","2003Q4","Healthcare2003Q4","Asia Pacific2003Q4","Oren Chase2003Q4","Entera CRM2003Q4"]
["Customer208","Healthcare","Europe","Product4",500,291,"Q1",2006,"Fritz Klein","2006Q1","Healthcare2006Q1","Europe2006Q1","Fritz Klein2006Q1","Product42006Q1"]
["Customer209","Services","North America","Product3",600,312,"Q4",2005,"Porter Le","2005Q4","Services2005Q4","North America2005Q4","Porter Le2005Q4","Product32005Q4"]
["Customer210","Services","North America","Product3",600,407,"Q2",2003,"Porter Le","2003Q2","Services2003Q2","North America2003Q2","Porter Le2003Q2","Product32003Q2"]
["Customer211","Technology","Europe","Product3",650,171,"Q1",2007,"Fritz Klein","2007Q1","Technology2007Q1","Europe2007Q1","Fritz Klein2007Q1","Product32007Q1"]
["Customer212","Finance","North America","Product1",400,466,"Q1",2003,"Porter Le","2003Q1","Finance2003Q1","North America2003Q1","Porter Le2003Q1","Product12003Q1"]
["Customer213","Technology","Europe","Entera CRM",650,283,"Q2",2004,"Fritz Klein","2004Q2","Technology2004Q2","Europe2004Q2","Fritz Klein2004Q2","Entera CRM2004Q2"]
["Customer214","Materials","Middle East","Product1",150,276,"Q2",2003,"Bradley Valenzuela","2003Q2","Materials2003Q2","Middle East2003Q2","Bradley Valenzuela2003Q2","Product12003Q2"]
["Customer215","Healthcare","Europe","Product3",500,70,"Q4",2003,"Fritz Klein","2003Q4","Healthcare2003Q4","Europe2003Q4","Fritz Klein2003Q4","Product32003Q4"]
["Customer216","Services","North America","Product4",600,349,"Q4",2005,"Porter Le","2005Q4","Services2005Q4","North America2005Q4","Porter Le2005Q4","Product42005Q4"]
["Customer217","Services","Asia Pacific","Entera CRM",600,982,"Q1",2007,"Oren Chase","2007Q1","Services2007Q1","Asia Pacific2007Q1","Oren Chase2007Q1","Entera CRM2007Q1"]
["Customer218","Services","North America","Product1",550,645,"Q3",2007,"Porter Le","2007Q3","Services2007Q3","North America2007Q3","Porter Le2007Q3","Product12007Q3"]
["Customer219","Technology","Europe","Entera CRM",650,763,"Q2",2006,"Fritz Klein","2006Q2","Technology2006Q2","Europe2006Q2","Fritz Klein2006Q2","Entera CRM2006Q2"]
["Customer220","Services","North America","Entera CRM",550,673,"Q3",2007,"Porter Le","2007Q3","Services2007Q3","North America2007Q3","Porter Le2007Q3","Entera CRM2007Q3"]
["Customer221","Consumer Goods","North America","Product3",200,654,"Q3",2006,"Porter Le","2006Q3","Consumer Goods2006Q3","North America2006Q3","Porter Le2006Q3","Product32006Q3"]
["Customer222","Healthcare","South America","Product2",450,118,"Q3",2005,"Nasim Hanson","2005Q3","Healthcare2005Q3","South America2005Q3","Nasim Hanson2005Q3","Product22005Q3"]
["Customer223","Consumer Goods","Europe","Product2",200,41,"Q4",2003,"Fritz Klein","2003Q4","Consumer Goods2003Q4","Europe2003Q4","Fritz Klein2003Q4","Product22003Q4"]
["Customer224","Consumer Goods","North America","Product2",200,959,"Q2",2005,"Porter Le","2005Q2","Consumer Goods2005Q2","North America2005Q2","Porter Le2005Q2","Product22005Q2"]
["Customer225","Services","Asia Pacific","Entera CRM",600,451,"Q1",2005,"Oren Chase","2005Q1","Services2005Q1","Asia Pacific2005Q1","Oren Chase2005Q1","Entera CRM2005Q1"]
["Customer226","Technology","Asia Pacific","Product3",650,134,"Q3",2005,"Oren Chase","2005Q3","Technology2005Q3","Asia Pacific2005Q3","Oren Chase2005Q3","Product32005Q3"]
["Customer227","Services","North America","Product4",600,619,"Q3",2006,"Porter Le","2006Q3","Services2006Q3","North America2006Q3","Porter Le2006Q3","Product42006Q3"]
["Customer228","Technology","North America","Product3",650,716,"Q2",2003,"Porter Le","2003Q2","Technology2003Q2","North America2003Q2","Porter Le2003Q2","Product32003Q2"]
["Customer229","Finance","North America","Product1",350,306,"Q4",2007,"Porter Le","2007Q4","Finance2007Q4","North America2007Q4","Porter Le2007Q4","Product12007Q4"]
["Customer230","Technology","North America","Product2",650,350,"Q4",2005,"Porter Le","2005Q4","Technology2005Q4","North America2005Q4","Porter Le2005Q4","Product22005Q4"]
["Customer231","Consumer Goods","Europe","Entera CRM",200,259,"Q2",2007,"Fritz Klein","2007Q2","Consumer Goods2007Q2","Europe2007Q2","Fritz Klein2007Q2","Entera CRM2007Q2"]
["Customer232","Materials","North America","Product2",100,315,"Q2",2008,"Porter Le","2008Q2","Materials2008Q2","North America2008Q2","Porter Le2008Q2","Product22008Q2"]
["Customer233","Healthcare","Europe","Product3",500,159,"Q4",2006,"Fritz Klein","2006Q4","Healthcare2006Q4","Europe2006Q4","Fritz Klein2006Q4","Product32006Q4"]
["Customer234","Healthcare","North America","Product2",500,135,"Q4",2005,"Porter Le","2005Q4","Healthcare2005Q4","North America2005Q4","Porter Le2005Q4","Product22005Q4"]
["Customer235","Utilities","South America","Product2",700,622,"Q4",2005,"Nasim Hanson","2005Q4","Utilities2005Q4","South America2005Q4","Nasim Hanson2005Q4","Product22005Q4"]
["Customer236","Healthcare","North America","Product4",500,864,"Q3",2004,"Porter Le","2004Q3","Healthcare2004Q3","North America2004Q3","Porter Le2004Q3","Product42004Q3"]
["Customer237","Materials","Europe","Entera CRM",150,74,"Q4",2006,"Fritz Klein","2006Q4","Materials2006Q4","Europe2006Q4","Fritz Klein2006Q4","Entera CRM2006Q4"]
["Customer238","Healthcare","North America","Product1",500,638,"Q3",2007,"Porter Le","2007Q3","Healthcare2007Q3","North America2007Q3","Porter Le2007Q3","Product12007Q3"]
["Customer239","Technology","Asia Pacific","Product2",650,849,"Q4",2005,"Oren Chase","2005Q4","Technology2005Q4","Asia Pacific2005Q4","Oren Chase2005Q4","Product22005Q4"]
["Customer240","Materials","North America","Entera CRM",100,850,"Q4",2006,"Porter Le","2006Q4","Materials2006Q4","North America2006Q4","Porter Le2006Q4","Entera CRM2006Q4"]
["Customer241","Utilities","South America","Product2",700,903,"Q2",2007,"Nasim Hanson","2007Q2","Utilities2007Q2","South America2007Q2","Nasim Hanson2007Q2","Product22007Q2"]
["Customer242","Services","North America","Product4",550,305,"Q4",2005,"Porter Le","2005Q4","Services2005Q4","North America2005Q4","Porter Le2005Q4","Product42005Q4"]
["Customer243","Services","North America","Entera CRM",550,445,"Q3",2005,"Porter Le","2005Q3","Services2005Q3","North America2005Q3","Porter Le2005Q3","Entera CRM2005Q3"]
["Customer244","Technology","North America","Product1",650,982,"Q4",2003,"Porter Le","2003Q4","Technology2003Q4","North America2003Q4","Porter Le2003Q4","Product12003Q4"]
["Customer245","Utilities","South America","Product2",700,814,"Q2",2006,"Nasim Hanson","2006Q2","Utilities2006Q2","South America2006Q2","Nasim Hanson2006Q2","Product22006Q2"]
["Customer246","Technology","Asia Pacific","Product1",650,770,"Q1",2006,"Oren Chase","2006Q1","Technology2006Q1","Asia Pacific2006Q1","Oren Chase2006Q1","Product12006Q1"]
["Customer247","Finance","North America","Product1",400,168,"Q4",2006,"Porter Le","2006Q4","Finance2006Q4","North America2006Q4","Porter Le2006Q4","Product12006Q4"]
["Customer248","Materials","Middle East","Product1",150,723,"Q2",2008,"Bradley Valenzuela","2008Q2","Materials2008Q2","Middle East2008Q2","Bradley Valenzuela2008Q2","Product12008Q2"]
["Customer249","Consumer Goods","Asia Pacific","Product2",250,970,"Q4",2003,"Oren Chase","2003Q4","Consumer Goods2003Q4","Asia Pacific2003Q4","Oren Chase2003Q4","Product22003Q4"]
["Customer250","Materials","Europe","Product3",150,177,"Q4",2003,"Fritz Klein","2003Q4","Materials2003Q4","Europe2003Q4","Fritz Klein2003Q4","Product32003Q4"]
["Customer251","Technology","Asia Pacific","Entera CRM",650,43,"Q3",2004,"Oren Chase","2004Q3","Technology2004Q3","Asia Pacific2004Q3","Oren Chase2004Q3","Entera CRM2004Q3"]
["Customer252","Materials","North America","Entera CRM",100,232,"Q3",2006,"Porter Le","2006Q3","Materials2006Q3","North America2006Q3","Porter Le2006Q3","Entera CRM2006Q3"]
["Customer253","Technology","Asia Pacific","Product4",700,511,"Q4",2006,"Oren Chase","2006Q4","Technology2006Q4","Asia Pacific2006Q4","Oren Chase2006Q4","Product42006Q4"]
["Customer254","Technology","North America","Product1",650,277,"Q2",2004,"Porter Le","2004Q2","Technology2004Q2","North America2004Q2","Porter Le2004Q2","Product12004Q2"]
["Customer255","Technology","Asia Pacific","Product3",650,689,"Q2",2005,"Oren Chase","2005Q2","Technology2005Q2","Asia Pacific2005Q2","Oren Chase2005Q2","Product32005Q2"]
["Customer256","Services","Asia Pacific","Product2",600,855,"Q1",2008,"Oren Chase","2008Q1","Services2008Q1","Asia Pacific2008Q1","Oren Chase2008Q1","Product22008Q1"]
["Customer257","Consumer Goods","Europe","Product3",250,692,"Q2",2006,"Fritz Klein","2006Q2","Consumer Goods2006Q2","Europe2006Q2","Fritz Klein2006Q2","Product32006Q2"]
["Customer258","Services","North America","Entera CRM",550,693,"Q1",2006,"Porter Le","2006Q1","Services2006Q1","North America2006Q1","Porter Le2006Q1","Entera CRM2006Q1"]
["Customer259","Utilities","South America","Product2",700,579,"Q4",2004,"Nasim Hanson","2004Q4","Utilities2004Q4","South America2004Q4","Nasim Hanson2004Q4","Product22004Q4"]
["Customer260","Services","Asia Pacific","Entera CRM",600,884,"Q3",2003,"Oren Chase","2003Q3","Services2003Q3","Asia Pacific2003Q3","Oren Chase2003Q3","Entera CRM2003Q3"]
["Customer261","Utilities","North America","Entera CRM",700,240,"Q1",2007,"Porter Le","2007Q1","Utilities2007Q1","North America2007Q1","Porter Le2007Q1","Entera CRM2007Q1"]
["Customer262","Healthcare","Asia Pacific","Product3",450,442,"Q3",2005,"Oren Chase","2005Q3","Healthcare2005Q3","Asia Pacific2005Q3","Oren Chase2005Q3","Product32005Q3"]
["Customer263","Consumer Goods","North America","Entera CRM",300,536,"Q2",2003,"Porter Le","2003Q2","Consumer Goods2003Q2","North America2003Q2","Porter Le2003Q2","Entera CRM2003Q2"]
["Customer264","Services","North America","Product1",600,849,"Q4",2003,"Porter Le","2003Q4","Services2003Q4","North America2003Q4","Porter Le2003Q4","Product12003Q4"]
["Customer265","Finance","North America","Product3",350,466,"Q3",2005,"Porter Le","2005Q3","Finance2005Q3","North America2005Q3","Porter Le2005Q3","Product32005Q3"]
["Customer266","Consumer Goods","North America","Entera CRM",200,681,"Q2",2004,"Porter Le","2004Q2","Consumer Goods2004Q2","North America2004Q2","Porter Le2004Q2","Entera CRM2004Q2"]
["Customer267","Finance","North America","Product1",350,380,"Q4",2004,"Porter Le","2004Q4","Finance2004Q4","North America2004Q4","Porter Le2004Q4","Product12004Q4"]
["Customer268","Finance","North America","Product3",350,814,"Q1",2003,"Porter Le","2003Q1","Finance2003Q1","North America2003Q1","Porter Le2003Q1","Product32003Q1"]
["Customer269","Consumer Goods","Asia Pacific","Product1",250,639,"Q4",2007,"Oren Chase","2007Q4","Consumer Goods2007Q4","Asia Pacific2007Q4","Oren Chase2007Q4","Product12007Q4"]
["Customer270","Utilities","South America","Product3",700,516,"Q1",2008,"Nasim Hanson","2008Q1","Utilities2008Q1","South America2008Q1","Nasim Hanson2008Q1","Product32008Q1"]
["Customer271","Technology","North America","Product1",650,199,"Q1",2004,"Porter Le","2004Q1","Technology2004Q1","North America2004Q1","Porter Le2004Q1","Product12004Q1"]
["Customer272","Consumer Goods","Asia Pacific","Entera CRM",250,971,"Q4",2004,"Oren Chase","2004Q4","Consumer Goods2004Q4","Asia Pacific2004Q4","Oren Chase2004Q4","Entera CRM2004Q4"]
["Customer273","Technology","Europe","Product3",650,472,"Q3",2003,"Fritz Klein","2003Q3","Technology2003Q3","Europe2003Q3","Fritz Klein2003Q3","Product32003Q3"]
["Customer274","Healthcare","Europe","Product2",500,910,"Q1",2008,"Fritz Klein","2008Q1","Healthcare2008Q1","Europe2008Q1","Fritz Klein2008Q1","Product22008Q1"]
["Customer275","Consumer Goods","Europe","Product2",200,103,"Q1",2005,"Fritz Klein","2005Q1","Consumer Goods2005Q1","Europe2005Q1","Fritz Klein2005Q1","Product22005Q1"]
["Customer276","Consumer Goods","North America","Entera CRM",300,506,"Q1",2005,"Porter Le","2005Q1","Consumer Goods2005Q1","North America2005Q1","Porter Le2005Q1","Entera CRM2005Q1"]
["Customer277","Healthcare","Europe","Product1",500,455,"Q1",2008,"Fritz Klein","2008Q1","Healthcare2008Q1","Europe2008Q1","Fritz Klein2008Q1","Product12008Q1"]
["Customer278","Finance","Europe","Product1",350,572,"Q2",2004,"Fritz Klein","2004Q2","Finance2004Q2","Europe2004Q2","Fritz Klein2004Q2","Product12004Q2"]
["Customer279","Consumer Goods","North America","Product1",300,506,"Q2",2003,"Porter Le","2003Q2","Consumer Goods2003Q2","North America2003Q2","Porter Le2003Q2","Product12003Q2"]
["Customer280","Consumer Goods","North America","Entera CRM",200,584,"Q1",2008,"Porter Le","2008Q1","Consumer Goods2008Q1","North America2008Q1","Porter Le2008Q1","Entera CRM2008Q1"]
["Customer281","Materials","Europe","Product4",100,791,"Q1",2008,"Fritz Klein","2008Q1","Materials2008Q1","Europe2008Q1","Fritz Klein2008Q1","Product42008Q1"]
["Customer282","Utilities","South America","Entera CRM",700,163,"Q4",2006,"Nasim Hanson","2006Q4","Utilities2006Q4","South America2006Q4","Nasim Hanson2006Q4","Entera CRM2006Q4"]
["Customer283","Materials","Asia Pacific","Product2",150,665,"Q4",2006,"Oren Chase","2006Q4","Materials2006Q4","Asia Pacific2006Q4","Oren Chase2006Q4","Product22006Q4"]
["Customer284","Finance","North America","Product4",300,569,"Q2",2007,"Porter Le","2007Q2","Finance2007Q2","North America2007Q2","Porter Le2007Q2","Product42007Q2"]
["Customer285","Consumer Goods","North America","Entera CRM",300,825,"Q2",2004,"Porter Le","2004Q2","Consumer Goods2004Q2","North America2004Q2","Porter Le2004Q2","Entera CRM2004Q2"]
["Customer286","Industrial Goods","Asia Pacific","Product4",550,166,"Q3",2004,"Oren Chase","2004Q3","Industrial Goods2004Q3","Asia Pacific2004Q3","Oren Chase2004Q3","Product42004Q3"]
["Customer287","Healthcare","Asia Pacific","Product4",450,524,"Q2",2008,"Oren Chase","2008Q2","Healthcare2008Q2","Asia Pacific2008Q2","Oren Chase2008Q2","Product42008Q2"]
["Customer288","Healthcare","Asia Pacific","Product4",450,617,"Q2",2006,"Oren Chase","2006Q2","Healthcare2006Q2","Asia Pacific2006Q2","Oren Chase2006Q2","Product42006Q2"]
["Customer289","Utilities","North America","Product4",700,609,"Q1",2006,"Porter Le","2006Q1","Utilities2006Q1","North America2006Q1","Porter Le2006Q1","Product42006Q1"]
["Customer290","Finance","North America","Product1",400,396,"Q4",2005,"Porter Le","2005Q4","Finance2005Q4","North America2005Q4","Porter Le2005Q4","Product12005Q4"]
["Customer291","Healthcare","Asia Pacific","Product2",450,330,"Q2",2006,"Oren Chase","2006Q2","Healthcare2006Q2","Asia Pacific2006Q2","Oren Chase2006Q2","Product22006Q2"]
["Customer292","Consumer Goods","North America","Product1",300,507,"Q2",2007,"Porter Le","2007Q2","Consumer Goods2007Q2","North America2007Q2","Porter Le2007Q2","Product12007Q2"]
["Customer293","Technology","North America","Product4",650,727,"Q3",2003,"Porter Le","2003Q3","Technology2003Q3","North America2003Q3","Porter Le2003Q3","Product42003Q3"]
["Customer294","Technology","North America","Product4",650,419,"Q2",2003,"Porter Le","2003Q2","Technology2003Q2","North America2003Q2","Porter Le2003Q2","Product42003Q2"]
["Customer295","Finance","North America","Entera CRM",400,636,"Q4",2008,"Porter Le","2008Q4","Finance2008Q4","North America2008Q4","Porter Le2008Q4","Entera CRM2008Q4"]
["Customer296","Consumer Goods","Europe","Product1",200,448,"Q3",2006,"Fritz Klein","2006Q3","Consumer Goods2006Q3","Europe2006Q3","Fritz Klein2006Q3","Product12006Q3"]
["Customer297","Materials","Europe","Product4",150,715,"Q2",2004,"Fritz Klein","2004Q2","Materials2004Q2","Europe2004Q2","Fritz Klein2004Q2","Product42004Q2"]
["Customer298","Services","Asia Pacific","Product3",600,632,"Q2",2006,"Oren Chase","2006Q2","Services2006Q2","Asia Pacific2006Q2","Oren Chase2006Q2","Product32006Q2"]
["Customer299","Consumer Goods","North America","Product4",300,702,"Q4",2008,"Porter Le","2008Q4","Consumer Goods2008Q4","North America2008Q4","Porter Le2008Q4","Product42008Q4"]
["Customer300","Healthcare","South America","Product4",450,390,"Q4",2003,"Nasim Hanson","2003Q4","Healthcare2003Q4","South America2003Q4","Nasim Hanson2003Q4","Product42003Q4"]
["Customer301","Materials","Asia Pacific","Product3",150,529,"Q4",2005,"Oren Chase","2005Q4","Materials2005Q4","Asia Pacific2005Q4","Oren Chase2005Q4","Product32005Q4"]
["Customer302","Services","North America","Product1",600,166,"Q4",2004,"Porter Le","2004Q4","Services2004Q4","North America2004Q4","Porter Le2004Q4","Product12004Q4"]
["Customer303","Finance","Europe","Product4",350,740,"Q3",2008,"Fritz Klein","2008Q3","Finance2008Q3","Europe2008Q3","Fritz Klein2008Q3","Product42008Q3"]
["Customer304","Materials","Asia Pacific","Product1",150,36,"Q1",2007,"Oren Chase","2007Q1","Materials2007Q1","Asia Pacific2007Q1","Oren Chase2007Q1","Product12007Q1"]
["Customer305","Consumer Goods","Asia Pacific","Product2",250,969,"Q1",2003,"Oren Chase","2003Q1","Consumer Goods2003Q1","Asia Pacific2003Q1","Oren Chase2003Q1","Product22003Q1"]
["Customer306","Consumer Goods","Europe","Entera CRM",200,806,"Q2",2007,"Fritz Klein","2007Q2","Consumer Goods2007Q2","Europe2007Q2","Fritz Klein2007Q2","Entera CRM2007Q2"]
["Customer307","Services","North America","Product1",550,93,"Q1",2003,"Porter Le","2003Q1","Services2003Q1","North America2003Q1","Porter Le2003Q1","Product12003Q1"]
["Customer308","Finance","Asia Pacific","Product1",400,558,"Q1",2006,"Oren Chase","2006Q1","Finance2006Q1","Asia Pacific2006Q1","Oren Chase2006Q1","Product12006Q1"]
["Customer309","Materials","North America","Product4",100,445,"Q1",2008,"Porter Le","2008Q1","Materials2008Q1","North America2008Q1","Porter Le2008Q1","Product42008Q1"]
["Customer310","Finance","North America","Product3",300,441,"Q1",2005,"Porter Le","2005Q1","Finance2005Q1","North America2005Q1","Porter Le2005Q1","Product32005Q1"]
["Customer311","Services","North America","Product2",600,899,"Q2",2007,"Porter Le","2007Q2","Services2007Q2","North America2007Q2","Porter Le2007Q2","Product22007Q2"]
["Customer312","Services","North America","Product3",550,731,"Q4",2006,"Porter Le","2006Q4","Services2006Q4","North America2006Q4","Porter Le2006Q4","Product32006Q4"]
["Customer313","Finance","North America","Entera CRM",350,227,"Q4",2006,"Porter Le","2006Q4","Finance2006Q4","North America2006Q4","Porter Le2006Q4","Entera CRM2006Q4"]
["Customer314","Consumer Goods","Europe","Product2",250,768,"Q3",2008,"Fritz Klein","2008Q3","Consumer Goods2008Q3","Europe2008Q3","Fritz Klein2008Q3","Product22008Q3"]
["Customer315","Healthcare","Europe","Product2",500,138,"Q2",2008,"Fritz Klein","2008Q2","Healthcare2008Q2","Europe2008Q2","Fritz Klein2008Q2","Product22008Q2"]
["Customer316","Materials","Europe","Product1",100,111,"Q3",2008,"Fritz Klein","2008Q3","Materials2008Q3","Europe2008Q3","Fritz Klein2008Q3","Product12008Q3"]
["Customer317","Technology","Asia Pacific","Entera CRM",700,272,"Q1",2006,"Oren Chase","2006Q1","Technology2006Q1","Asia Pacific2006Q1","Oren Chase2006Q1","Entera CRM2006Q1"]
["Customer318","Technology","Asia Pacific","Entera CRM",700,824,"Q3",2007,"Oren Chase","2007Q3","Technology2007Q3","Asia Pacific2007Q3","Oren Chase2007Q3","Entera CRM2007Q3"]
["Customer319","Materials","Europe","Product1",150,890,"Q2",2004,"Fritz Klein","2004Q2","Materials2004Q2","Europe2004Q2","Fritz Klein2004Q2","Product12004Q2"]
["Customer320","Materials","Europe","Product3",100,295,"Q3",2005,"Fritz Klein","2005Q3","Materials2005Q3","Europe2005Q3","Fritz Klein2005Q3","Product32005Q3"]
["Customer321","Healthcare","South America","Entera CRM",500,266,"Q4",2007,"Nasim Hanson","2007Q4","Healthcare2007Q4","South America2007Q4","Nasim Hanson2007Q4","Entera CRM2007Q4"]
["Customer322","Utilities","North America","Product2",700,244,"Q2",2003,"Porter Le","2003Q2","Utilities2003Q2","North America2003Q2","Porter Le2003Q2","Product22003Q2"]
["Customer323","Materials","Europe","Product3",150,766,"Q4",2005,"Fritz Klein","2005Q4","Materials2005Q4","Europe2005Q4","Fritz Klein2005Q4","Product32005Q4"]
["Customer324","Materials","Asia Pacific","Product4",150,507,"Q4",2005,"Oren Chase","2005Q4","Materials2005Q4","Asia Pacific2005Q4","Oren Chase2005Q4","Product42005Q4"]
["Customer325","Finance","Asia Pacific","Product4",450,773,"Q2",2007,"Oren Chase","2007Q2","Finance2007Q2","Asia Pacific2007Q2","Oren Chase2007Q2","Product42007Q2"]
["Customer326","Finance","Europe","Product3",350,586,"Q2",2007,"Fritz Klein","2007Q2","Finance2007Q2","Europe2007Q2","Fritz Klein2007Q2","Product32007Q2"]
["Customer327","Finance","North America","Product1",350,681,"Q4",2008,"Porter Le","2008Q4","Finance2008Q4","North America2008Q4","Porter Le2008Q4","Product12008Q4"]
["Customer328","Finance","Europe","Product2",400,416,"Q4",2008,"Fritz Klein","2008Q4","Finance2008Q4","Europe2008Q4","Fritz Klein2008Q4","Product22008Q4"]
["Customer329","Healthcare","South America","Product4",450,424,"Q3",2005,"Nasim Hanson","2005Q3","Healthcare2005Q3","South America2005Q3","Nasim Hanson2005Q3","Product42005Q3"]
["Customer330","Materials","Asia Pacific","Entera CRM",150,268,"Q1",2007,"Oren Chase","2007Q1","Materials2007Q1","Asia Pacific2007Q1","Oren Chase2007Q1","Entera CRM2007Q1"]
["Customer331","Finance","Europe","Entera CRM",400,831,"Q1",2008,"Fritz Klein","2008Q1","Finance2008Q1","Europe2008Q1","Fritz Klein2008Q1","Entera CRM2008Q1"]
["Customer332","Materials","North America","Entera CRM",100,817,"Q4",2004,"Porter Le","2004Q4","Materials2004Q4","North America2004Q4","Porter Le2004Q4","Entera CRM2004Q4"]
["Customer333","Finance","North America","Product3",350,888,"Q4",2005,"Porter Le","2005Q4","Finance2005Q4","North America2005Q4","Porter Le2005Q4","Product32005Q4"]
["Customer334","Finance","North America","Product2",300,561,"Q2",2008,"Porter Le","2008Q2","Finance2008Q2","North America2008Q2","Porter Le2008Q2","Product22008Q2"]
["Customer335","Healthcare","North America","Product4",500,503,"Q3",2004,"Porter Le","2004Q3","Healthcare2004Q3","North America2004Q3","Porter Le2004Q3","Product42004Q3"]
["Customer336","Services","North America","Entera CRM",550,957,"Q3",2003,"Porter Le","2003Q3","Services2003Q3","North America2003Q3","Porter Le2003Q3","Entera CRM2003Q3"]
["Customer337","Utilities","South America","Product4",700,903,"Q4",2005,"Nasim Hanson","2005Q4","Utilities2005Q4","South America2005Q4","Nasim Hanson2005Q4","Product42005Q4"]
["Customer338","Technology","Asia Pacific","Product3",700,797,"Q3",2004,"Oren Chase","2004Q3","Technology2004Q3","Asia Pacific2004Q3","Oren Chase2004Q3","Product32004Q3"]
["Customer339","Consumer Goods","Europe","Product1",200,852,"Q3",2003,"Fritz Klein","2003Q3","Consumer Goods2003Q3","Europe2003Q3","Fritz Klein2003Q3","Product12003Q3"]
["Customer340","Services","Asia Pacific","Product2",600,632,"Q2",2008,"Oren Chase","2008Q2","Services2008Q2","Asia Pacific2008Q2","Oren Chase2008Q2","Product22008Q2"]
["Customer341","Finance","North America","Product1",350,707,"Q3",2005,"Porter Le","2005Q3","Finance2005Q3","North America2005Q3","Porter Le2005Q3","Product12005Q3"]
["Customer342","Materials","Europe","Entera CRM",150,998,"Q1",2003,"Fritz Klein","2003Q1","Materials2003Q1","Europe2003Q1","Fritz Klein2003Q1","Entera CRM2003Q1"]
["Customer343","Materials","North America","Product4",100,33,"Q3",2005,"Porter Le","2005Q3","Materials2005Q3","North America2005Q3","Porter Le2005Q3","Product42005Q3"]
["Customer344","Finance","North America","Product2",300,840,"Q1",2008,"Porter Le","2008Q1","Finance2008Q1","North America2008Q1","Porter Le2008Q1","Product22008Q1"]
["Customer345","Finance","Europe","Product4",350,475,"Q2",2004,"Fritz Klein","2004Q2","Finance2004Q2","Europe2004Q2","Fritz Klein2004Q2","Product42004Q2"]
["Customer346","Healthcare","Asia Pacific","Entera CRM",450,537,"Q2",2008,"Oren Chase","2008Q2","Healthcare2008Q2","Asia Pacific2008Q2","Oren Chase2008Q2","Entera CRM2008Q2"]
["Customer347","Finance","North America","Product3",350,861,"Q3",2008,"Porter Le","2008Q3","Finance2008Q3","North America2008Q3","Porter Le2008Q3","Product32008Q3"]
["Customer348","Finance","North America","Product3",350,974,"Q2",2005,"Porter Le","2005Q2","Finance2005Q2","North America2005Q2","Porter Le2005Q2","Product32005Q2"]
["Customer349","Services","North America","Entera CRM",600,766,"Q4",2003,"Porter Le","2003Q4","Services2003Q4","North America2003Q4","Porter Le2003Q4","Entera CRM2003Q4"]
["Customer350","Materials","North America","Product3",100,230,"Q2",2005,"Porter Le","2005Q2","Materials2005Q2","North America2005Q2","Porter Le2005Q2","Product32005Q2"]
["Customer351","Materials","Asia Pacific","Entera CRM",150,882,"Q1",2005,"Oren Chase","2005Q1","Materials2005Q1","Asia Pacific2005Q1","Oren Chase2005Q1","Entera CRM2005Q1"]
["Customer352","Healthcare","North America","Product1",500,765,"Q2",2007,"Porter Le","2007Q2","Healthcare2007Q2","North America2007Q2","Porter Le2007Q2","Product12007Q2"]
["Customer353","Consumer Goods","Europe","Product4",200,73,"Q2",2005,"Fritz Klein","2005Q2","Consumer Goods2005Q2","Europe2005Q2","Fritz Klein2005Q2","Product42005Q2"]
["Customer354","Healthcare","Europe","Product1",500,314,"Q2",2005,"Fritz Klein","2005Q2","Healthcare2005Q2","Europe2005Q2","Fritz Klein2005Q2","Product12005Q2"]
["Customer355","Consumer Goods","North America","Product4",200,396,"Q1",2007,"Porter Le","2007Q1","Consumer Goods2007Q1","North America2007Q1","Porter Le2007Q1","Product42007Q1"]
["Customer356","Services","Asia Pacific","Product3",600,355,"Q2",2003,"Oren Chase","2003Q2","Services2003Q2","Asia Pacific2003Q2","Oren Chase2003Q2","Product32003Q2"]
["Customer357","Materials","Middle East","Product3",200,708,"Q2",2006,"Bradley Valenzuela","2006Q2","Materials2006Q2","Middle East2006Q2","Bradley Valenzuela2006Q2","Product32006Q2"]
["Customer358","Technology","Asia Pacific","Product4",650,555,"Q2",2007,"Oren Chase","2007Q2","Technology2007Q2","Asia Pacific2007Q2","Oren Chase2007Q2","Product42007Q2"]
["Customer359","Finance","Europe","Product3",400,973,"Q4",2007,"Fritz Klein","2007Q4","Finance2007Q4","Europe2007Q4","Fritz Klein2007Q4","Product32007Q4"]
["Customer360","Consumer Goods","Europe","Entera CRM",250,663,"Q3",2008,"Fritz Klein","2008Q3","Consumer Goods2008Q3","Europe2008Q3","Fritz Klein2008Q3","Entera CRM2008Q3"]
["Customer361","Consumer Goods","North America","Entera CRM",300,76,"Q1",2008,"Porter Le","2008Q1","Consumer Goods2008Q1","North America2008Q1","Porter Le2008Q1","Entera CRM2008Q1"]
["Customer362","Healthcare","North America","Product4",500,859,"Q3",2007,"Porter Le","2007Q3","Healthcare2007Q3","North America2007Q3","Porter Le2007Q3","Product42007Q3"]
["Customer363","Finance","North America","Product3",300,311,"Q2",2004,"Porter Le","2004Q2","Finance2004Q2","North America2004Q2","Porter Le2004Q2","Product32004Q2"]
["Customer364","Materials","South America","Product1",100,890,"Q1",2006,"Nasim Hanson","2006Q1","Materials2006Q1","South America2006Q1","Nasim Hanson2006Q1","Product12006Q1"]
["Customer365","Consumer Goods","Asia Pacific","Product1",250,143,"Q4",2007,"Oren Chase","2007Q4","Consumer Goods2007Q4","Asia Pacific2007Q4","Oren Chase2007Q4","Product12007Q4"]
["Customer366","Finance","Asia Pacific","Product2",450,953,"Q2",2008,"Oren Chase","2008Q2","Finance2008Q2","Asia Pacific2008Q2","Oren Chase2008Q2","Product22008Q2"]
["Customer367","Materials","Middle East","Product1",150,709,"Q4",2006,"Bradley Valenzuela","2006Q4","Materials2006Q4","Middle East2006Q4","Bradley Valenzuela2006Q4","Product12006Q4"]
["Customer368","Materials","South America","Product4",100,815,"Q2",2005,"Nasim Hanson","2005Q2","Materials2005Q2","South America2005Q2","Nasim Hanson2005Q2","Product42005Q2"]
["Customer369","Finance","Europe","Entera CRM",350,543,"Q4",2008,"Fritz Klein","2008Q4","Finance2008Q4","Europe2008Q4","Fritz Klein2008Q4","Entera CRM2008Q4"]
["Customer370","Consumer Goods","Asia Pacific","Product3",250,511,"Q4",2005,"Oren Chase","2005Q4","Consumer Goods2005Q4","Asia Pacific2005Q4","Oren Chase2005Q4","Product32005Q4"]
["Customer371","Finance","Europe","Product1",350,217,"Q4",2004,"Fritz Klein","2004Q4","Finance2004Q4","Europe2004Q4","Fritz Klein2004Q4","Product12004Q4"]
["Customer372","Utilities","South America","Product2",700,705,"Q2",2006,"Nasim Hanson","2006Q2","Utilities2006Q2","South America2006Q2","Nasim Hanson2006Q2","Product22006Q2"]
["Customer373","Healthcare","Europe","Entera CRM",500,903,"Q2",2005,"Fritz Klein","2005Q2","Healthcare2005Q2","Europe2005Q2","Fritz Klein2005Q2","Entera CRM2005Q2"]
["Customer374","Utilities","South America","Entera CRM",700,799,"Q2",2006,"Nasim Hanson","2006Q2","Utilities2006Q2","South America2006Q2","Nasim Hanson2006Q2","Entera CRM2006Q2"]
["Customer375","Technology","Europe","Product4",650,522,"Q1",2004,"Fritz Klein","2004Q1","Technology2004Q1","Europe2004Q1","Fritz Klein2004Q1","Product42004Q1"]
["Customer376","Consumer Goods","North America","Product3",300,721,"Q4",2006,"Porter Le","2006Q4","Consumer Goods2006Q4","North America2006Q4","Porter Le2006Q4","Product32006Q4"]
["Customer377","Technology","North America","Product3",650,313,"Q2",2007,"Porter Le","2007Q2","Technology2007Q2","North America2007Q2","Porter Le2007Q2","Product32007Q2"]
["Customer378","Consumer Goods","Europe","Product1",200,335,"Q1",2003,"Fritz Klein","2003Q1","Consumer Goods2003Q1","Europe2003Q1","Fritz Klein2003Q1","Product12003Q1"]
["Customer379","Healthcare","Asia Pacific","Product4",450,665,"Q3",2005,"Oren Chase","2005Q3","Healthcare2005Q3","Asia Pacific2005Q3","Oren Chase2005Q3","Product42005Q3"]
["Customer380","Services","North America","Product4",550,526,"Q3",2004,"Porter Le","2004Q3","Services2004Q3","North America2004Q3","Porter Le2004Q3","Product42004Q3"]
["Customer381","Consumer Goods","Europe","Product1",300,131,"Q2",2004,"Fritz Klein","2004Q2","Consumer Goods2004Q2","Europe2004Q2","Fritz Klein2004Q2","Product12004Q2"]
["Customer382","Industrial Goods","Asia Pacific","Product1",550,250,"Q3",2006,"Oren Chase","2006Q3","Industrial Goods2006Q3","Asia Pacific2006Q3","Oren Chase2006Q3","Product12006Q3"]
["Customer383","Finance","Europe","Product3",350,847,"Q1",2007,"Fritz Klein","2007Q1","Finance2007Q1","Europe2007Q1","Fritz Klein2007Q1","Product32007Q1"]
["Customer384","Finance","North America","Product3",300,943,"Q1",2006,"Porter Le","2006Q1","Finance2006Q1","North America2006Q1","Porter Le2006Q1","Product32006Q1"]
["Customer385","Consumer Goods","Europe","Entera CRM",250,612,"Q1",2008,"Fritz Klein","2008Q1","Consumer Goods2008Q1","Europe2008Q1","Fritz Klein2008Q1","Entera CRM2008Q1"]
["Customer386","Finance","North America","Entera CRM",350,834,"Q3",2005,"Porter Le","2005Q3","Finance2005Q3","North America2005Q3","Porter Le2005Q3","Entera CRM2005Q3"]
["Customer387","Technology","Europe","Product3",650,256,"Q4",2006,"Fritz Klein","2006Q4","Technology2006Q4","Europe2006Q4","Fritz Klein2006Q4","Product32006Q4"]
["Customer388","Finance","Europe","Product2",350,199,"Q4",2003,"Fritz Klein","2003Q4","Finance2003Q4","Europe2003Q4","Fritz Klein2003Q4","Product22003Q4"]
["Customer389","Technology","Asia Pacific","Product1",650,575,"Q3",2007,"Oren Chase","2007Q3","Technology2007Q3","Asia Pacific2007Q3","Oren Chase2007Q3","Product12007Q3"]
["Customer390","Technology","Asia Pacific","Product3",700,435,"Q1",2004,"Oren Chase","2004Q1","Technology2004Q1","Asia Pacific2004Q1","Oren Chase2004Q1","Product32004Q1"]
["Customer391","Consumer Goods","Asia Pacific","Product3",250,706,"Q3",2007,"Oren Chase","2007Q3","Consumer Goods2007Q3","Asia Pacific2007Q3","Oren Chase2007Q3","Product32007Q3"]
["Customer392","Materials","North America","Product4",100,682,"Q4",2005,"Porter Le","2005Q4","Materials2005Q4","North America2005Q4","Porter Le2005Q4","Product42005Q4"]
["Customer393","Finance","Europe","Product2",350,767,"Q2",2005,"Fritz Klein","2005Q2","Finance2005Q2","Europe2005Q2","Fritz Klein2005Q2","Product22005Q2"]
["Customer394","Materials","North America","Product3",100,440,"Q3",2008,"Porter Le","2008Q3","Materials2008Q3","North America2008Q3","Porter Le2008Q3","Product32008Q3"]
["Customer395","Materials","North America","Product2",100,237,"Q1",2006,"Porter Le","2006Q1","Materials2006Q1","North America2006Q1","Porter Le2006Q1","Product22006Q1"]
["Customer396","Services","North America","Product3",600,209,"Q2",2005,"Porter Le","2005Q2","Services2005Q2","North America2005Q2","Porter Le2005Q2","Product32005Q2"]
["Customer397","Industrial Goods","Asia Pacific","Product1",550,829,"Q3",2003,"Oren Chase","2003Q3","Industrial Goods2003Q3","Asia Pacific2003Q3","Oren Chase2003Q3","Product12003Q3"]
["Customer398","Consumer Goods","Europe","Product3",300,777,"Q3",2008,"Fritz Klein","2008Q3","Consumer Goods2008Q3","Europe2008Q3","Fritz Klein2008Q3","Product32008Q3"]
["Customer399","Finance","Europe","Entera CRM",400,111,"Q2",2005,"Fritz Klein","2005Q2","Finance2005Q2","Europe2005Q2","Fritz Klein2005Q2","Entera CRM2005Q2"]
["Customer400","Finance","North America","Product4",300,181,"Q2",2003,"Porter Le","2003Q2","Finance2003Q2","North America2003Q2","Porter Le2003Q2","Product42003Q2"]
["Customer401","Services","North America","Product2",600,790,"Q4",2005,"Porter Le","2005Q4","Services2005Q4","North America2005Q4","Porter Le2005Q4","Product22005Q4"]
["Customer402","Materials","South America","Product1",100,722,"Q1",2008,"Nasim Hanson","2008Q1","Materials2008Q1","South America2008Q1","Nasim Hanson2008Q1","Product12008Q1"]
["Customer403","Finance","North America","Product2",350,650,"Q3",2007,"Porter Le","2007Q3","Finance2007Q3","North America2007Q3","Porter Le2007Q3","Product22007Q3"]
["Customer404","Finance","North America","Product4",300,806,"Q1",2003,"Porter Le","2003Q1","Finance2003Q1","North America2003Q1","Porter Le2003Q1","Product42003Q1"]
["Customer405","Healthcare","Asia Pacific","Product3",450,316,"Q4",2006,"Oren Chase","2006Q4","Healthcare2006Q4","Asia Pacific2006Q4","Oren Chase2006Q4","Product32006Q4"]
["Customer406","Materials","South America","Product4",100,109,"Q1",2005,"Nasim Hanson","2005Q1","Materials2005Q1","South America2005Q1","Nasim Hanson2005Q1","Product42005Q1"]
["Customer407","Industrial Goods","Asia Pacific","Product4",500,967,"Q3",2006,"Oren Chase","2006Q3","Industrial Goods2006Q3","Asia Pacific2006Q3","Oren Chase2006Q3","Product42006Q3"]
["Customer408","Consumer Goods","Europe","Product4",250,311,"Q1",2007,"Fritz Klein","2007Q1","Consumer Goods2007Q1","Europe2007Q1","Fritz Klein2007Q1","Product42007Q1"]
["Customer409","Services","Asia Pacific","Product3",600,949,"Q4",2003,"Oren Chase","2003Q4","Services2003Q4","Asia Pacific2003Q4","Oren Chase2003Q4","Product32003Q4"]
["Customer410","Materials","South America","Entera CRM",100,342,"Q1",2005,"Nasim Hanson","2005Q1","Materials2005Q1","South America2005Q1","Nasim Hanson2005Q1","Entera CRM2005Q1"]
["Customer411","Consumer Goods","Europe","Entera CRM",250,878,"Q3",2008,"Fritz Klein","2008Q3","Consumer Goods2008Q3","Europe2008Q3","Fritz Klein2008Q3","Entera CRM2008Q3"]
["Customer412","Consumer Goods","Europe","Product1",200,803,"Q1",2007,"Fritz Klein","2007Q1","Consumer Goods2007Q1","Europe2007Q1","Fritz Klein2007Q1","Product12007Q1"]
["Customer413","Finance","North America","Product2",350,473,"Q2",2007,"Porter Le","2007Q2","Finance2007Q2","North America2007Q2","Porter Le2007Q2","Product22007Q2"]
["Customer414","Consumer Goods","Europe","Product4",200,774,"Q1",2005,"Fritz Klein","2005Q1","Consumer Goods2005Q1","Europe2005Q1","Fritz Klein2005Q1","Product42005Q1"]
["Customer415","Industrial Goods","Asia Pacific","Product1",550,515,"Q4",2008,"Oren Chase","2008Q4","Industrial Goods2008Q4","Asia Pacific2008Q4","Oren Chase2008Q4","Product12008Q4"]
["Customer416","Technology","Europe","Product1",650,740,"Q3",2008,"Fritz Klein","2008Q3","Technology2008Q3","Europe2008Q3","Fritz Klein2008Q3","Product12008Q3"]
["Customer417","Utilities","North America","Product2",700,910,"Q3",2007,"Porter Le","2007Q3","Utilities2007Q3","North America2007Q3","Porter Le2007Q3","Product22007Q3"]
["Customer418","Healthcare","Asia Pacific","Product2",450,347,"Q1",2006,"Oren Chase","2006Q1","Healthcare2006Q1","Asia Pacific2006Q1","Oren Chase2006Q1","Product22006Q1"]
["Customer419","Finance","Europe","Product1",400,986,"Q2",2003,"Fritz Klein","2003Q2","Finance2003Q2","Europe2003Q2","Fritz Klein2003Q2","Product12003Q2"]
["Customer420","Materials","Asia Pacific","Product1",150,886,"Q3",2003,"Oren Chase","2003Q3","Materials2003Q3","Asia Pacific2003Q3","Oren Chase2003Q3","Product12003Q3"]
["Customer421","Materials","Asia Pacific","Product4",150,530,"Q4",2008,"Oren Chase","2008Q4","Materials2008Q4","Asia Pacific2008Q4","Oren Chase2008Q4","Product42008Q4"]
["Customer422","Healthcare","Asia Pacific","Entera CRM",450,237,"Q2",2003,"Oren Chase","2003Q2","Healthcare2003Q2","Asia Pacific2003Q2","Oren Chase2003Q2","Entera CRM2003Q2"]
["Customer423","Consumer Goods","North America","Product4",300,978,"Q2",2003,"Porter Le","2003Q2","Consumer Goods2003Q2","North America2003Q2","Porter Le2003Q2","Product42003Q2"]
["Customer424","Services","North America","Product1",550,396,"Q1",2003,"Porter Le","2003Q1","Services2003Q1","North America2003Q1","Porter Le2003Q1","Product12003Q1"]
["Customer425","Consumer Goods","Europe","Entera CRM",250,209,"Q4",2003,"Fritz Klein","2003Q4","Consumer Goods2003Q4","Europe2003Q4","Fritz Klein2003Q4","Entera CRM2003Q4"]
["Customer426","Finance","North America","Product1",400,997,"Q2",2006,"Porter Le","2006Q2","Finance2006Q2","North America2006Q2","Porter Le2006Q2","Product12006Q2"]
["Customer427","Services","North America","Product4",550,877,"Q3",2003,"Porter Le","2003Q3","Services2003Q3","North America2003Q3","Porter Le2003Q3","Product42003Q3"]
["Customer428","Finance","Europe","Product4",350,51,"Q1",2007,"Fritz Klein","2007Q1","Finance2007Q1","Europe2007Q1","Fritz Klein2007Q1","Product42007Q1"]
["Customer429","Consumer Goods","North America","Product1",300,986,"Q1",2003,"Porter Le","2003Q1","Consumer Goods2003Q1","North America2003Q1","Porter Le2003Q1","Product12003Q1"]
["Customer430","Services","North America","Entera CRM",600,226,"Q2",2008,"Porter Le","2008Q2","Services2008Q2","North America2008Q2","Porter Le2008Q2","Entera CRM2008Q2"]
["Customer431","Materials","Asia Pacific","Entera CRM",150,381,"Q1",2006,"Oren Chase","2006Q1","Materials2006Q1","Asia Pacific2006Q1","Oren Chase2006Q1","Entera CRM2006Q1"]
["Customer432","Materials","Asia Pacific","Product4",150,219,"Q2",2005,"Oren Chase","2005Q2","Materials2005Q2","Asia Pacific2005Q2","Oren Chase2005Q2","Product42005Q2"]
["Customer433","Services","North America","Product2",600,139,"Q1",2004,"Porter Le","2004Q1","Services2004Q1","North America2004Q1","Porter Le2004Q1","Product22004Q1"]
["Customer434","Finance","Europe","Product4",350,360,"Q2",2003,"Fritz Klein","2003Q2","Finance2003Q2","Europe2003Q2","Fritz Klein2003Q2","Product42003Q2"]
["Customer435","Technology","Europe","Product3",650,884,"Q3",2003,"Fritz Klein","2003Q3","Technology2003Q3","Europe2003Q3","Fritz Klein2003Q3","Product32003Q3"]
["Customer436","Materials","Middle East","Product4",150,509,"Q2",2006,"Bradley Valenzuela","2006Q2","Materials2006Q2","Middle East2006Q2","Bradley Valenzuela2006Q2","Product42006Q2"]
["Customer437","Finance","North America","Entera CRM",400,142,"Q4",2008,"Porter Le","2008Q4","Finance2008Q4","North America2008Q4","Porter Le2008Q4","Entera CRM2008Q4"]
["Customer438","Consumer Goods","North America","Product2",200,996,"Q3",2006,"Porter Le","2006Q3","Consumer Goods2006Q3","North America2006Q3","Porter Le2006Q3","Product22006Q3"]
["Customer439","Consumer Goods","Europe","Entera CRM",200,592,"Q3",2007,"Fritz Klein","2007Q3","Consumer Goods2007Q3","Europe2007Q3","Fritz Klein2007Q3","Entera CRM2007Q3"]
["Customer440","Finance","Europe","Product3",400,659,"Q3",2004,"Fritz Klein","2004Q3","Finance2004Q3","Europe2004Q3","Fritz Klein2004Q3","Product32004Q3"]
["Customer441","Consumer Goods","Europe","Product1",200,437,"Q2",2007,"Fritz Klein","2007Q2","Consumer Goods2007Q2","Europe2007Q2","Fritz Klein2007Q2","Product12007Q2"]
["Customer442","Finance","North America","Product4",300,249,"Q2",2007,"Porter Le","2007Q2","Finance2007Q2","North America2007Q2","Porter Le2007Q2","Product42007Q2"]
["Customer443","Technology","Asia Pacific","Product2",700,198,"Q3",2006,"Oren Chase","2006Q3","Technology2006Q3","Asia Pacific2006Q3","Oren Chase2006Q3","Product22006Q3"]
["Customer444","Materials","Europe","Product2",100,964,"Q1",2007,"Fritz Klein","2007Q1","Materials2007Q1","Europe2007Q1","Fritz Klein2007Q1","Product22007Q1"]
["Customer445","Finance","North America","Entera CRM",300,494,"Q3",2005,"Porter Le","2005Q3","Finance2005Q3","North America2005Q3","Porter Le2005Q3","Entera CRM2005Q3"]
["Customer446","Industrial Goods","Asia Pacific","Entera CRM",550,105,"Q3",2006,"Oren Chase","2006Q3","Industrial Goods2006Q3","Asia Pacific2006Q3","Oren Chase2006Q3","Entera CRM2006Q3"]
["Customer447","Technology","North America","Product1",650,857,"Q1",2003,"Porter Le","2003Q1","Technology2003Q1","North America2003Q1","Porter Le2003Q1","Product12003Q1"]
["Customer448","Materials","Middle East","Product1",150,335,"Q1",2004,"Bradley Valenzuela","2004Q1","Materials2004Q1","Middle East2004Q1","Bradley Valenzuela2004Q1","Product12004Q1"]
["Customer449","Materials","South America","Product4",100,45,"Q1",2007,"Nasim Hanson","2007Q1","Materials2007Q1","South America2007Q1","Nasim Hanson2007Q1","Product42007Q1"]
["Customer450","Consumer Goods","North America","Product4",300,280,"Q3",2003,"Porter Le","2003Q3","Consumer Goods2003Q3","North America2003Q3","Porter Le2003Q3","Product42003Q3"]
["Customer451","Services","North America","Product3",600,766,"Q1",2003,"Porter Le","2003Q1","Services2003Q1","North America2003Q1","Porter Le2003Q1","Product32003Q1"]
["Customer452","Materials","South America","Entera CRM",100,538,"Q1",2006,"Nasim Hanson","2006Q1","Materials2006Q1","South America2006Q1","Nasim Hanson2006Q1","Entera CRM2006Q1"]
["Customer453","Finance","Asia Pacific","Product1",450,604,"Q2",2004,"Oren Chase","2004Q2","Finance2004Q2","Asia Pacific2004Q2","Oren Chase2004Q2","Product12004Q2"]
["Customer454","Consumer Goods","Europe","Product3",250,237,"Q3",2003,"Fritz Klein","2003Q3","Consumer Goods2003Q3","Europe2003Q3","Fritz Klein2003Q3","Product32003Q3"]
["Customer455","Consumer Goods","North America","Product4",200,625,"Q2",2004,"Porter Le","2004Q2","Consumer Goods2004Q2","North America2004Q2","Porter Le2004Q2","Product42004Q2"]
["Customer456","Finance","Asia Pacific","Product2",450,652,"Q4",2003,"Oren Chase","2003Q4","Finance2003Q4","Asia Pacific2003Q4","Oren Chase2003Q4","Product22003Q4"]
["Customer457","Utilities","North America","Product3",700,629,"Q4",2004,"Porter Le","2004Q4","Utilities2004Q4","North America2004Q4","Porter Le2004Q4","Product32004Q4"]
["Customer458","Consumer Goods","Asia Pacific","Product3",250,446,"Q4",2008,"Oren Chase","2008Q4","Consumer Goods2008Q4","Asia Pacific2008Q4","Oren Chase2008Q4","Product32008Q4"]
["Customer459","Technology","Europe","Product4",650,880,"Q3",2005,"Fritz Klein","2005Q3","Technology2005Q3","Europe2005Q3","Fritz Klein2005Q3","Product42005Q3"]
["Customer460","Finance","North America","Product4",300,274,"Q4",2005,"Porter Le","2005Q4","Finance2005Q4","North America2005Q4","Porter Le2005Q4","Product42005Q4"]
["Customer461","Finance","Europe","Product1",350,865,"Q3",2005,"Fritz Klein","2005Q3","Finance2005Q3","Europe2005Q3","Fritz Klein2005Q3","Product12005Q3"]
["Customer462","Consumer Goods","North America","Product2",300,895,"Q1",2003,"Porter Le","2003Q1","Consumer Goods2003Q1","North America2003Q1","Porter Le2003Q1","Product22003Q1"]
["Customer463","Services","North America","Product1",550,100,"Q3",2008,"Porter Le","2008Q3","Services2008Q3","North America2008Q3","Porter Le2008Q3","Product12008Q3"]
["Customer464","Services","North America","Product4",550,804,"Q3",2003,"Porter Le","2003Q3","Services2003Q3","North America2003Q3","Porter Le2003Q3","Product42003Q3"]
["Customer465","Consumer Goods","North America","Product4",300,290,"Q2",2003,"Porter Le","2003Q2","Consumer Goods2003Q2","North America2003Q2","Porter Le2003Q2","Product42003Q2"]
["Customer466","Industrial Goods","Asia Pacific","Product3",550,755,"Q1",2003,"Oren Chase","2003Q1","Industrial Goods2003Q1","Asia Pacific2003Q1","Oren Chase2003Q1","Product32003Q1"]
["Customer467","Healthcare","Europe","Product4",500,146,"Q2",2008,"Fritz Klein","2008Q2","Healthcare2008Q2","Europe2008Q2","Fritz Klein2008Q2","Product42008Q2"]
["Customer468","Finance","Asia Pacific","Product1",450,336,"Q3",2004,"Oren Chase","2004Q3","Finance2004Q3","Asia Pacific2004Q3","Oren Chase2004Q3","Product12004Q3"]
["Customer469","Materials","Europe","Product3",100,394,"Q2",2004,"Fritz Klein","2004Q2","Materials2004Q2","Europe2004Q2","Fritz Klein2004Q2","Product32004Q2"]
["Customer470","Consumer Goods","North America","Product4",300,623,"Q3",2008,"Porter Le","2008Q3","Consumer Goods2008Q3","North America2008Q3","Porter Le2008Q3","Product42008Q3"]
["Customer471","Technology","North America","Product4",650,285,"Q4",2006,"Porter Le","2006Q4","Technology2006Q4","North America2006Q4","Porter Le2006Q4","Product42006Q4"]
["Customer472","Consumer Goods","Europe","Product1",250,775,"Q1",2006,"Fritz Klein","2006Q1","Consumer Goods2006Q1","Europe2006Q1","Fritz Klein2006Q1","Product12006Q1"]
["Customer473","Utilities","South America","Entera CRM",700,799,"Q1",2003,"Nasim Hanson","2003Q1","Utilities2003Q1","South America2003Q1","Nasim Hanson2003Q1","Entera CRM2003Q1"]
["Customer474","Consumer Goods","Europe","Product2",200,889,"Q2",2003,"Fritz Klein","2003Q2","Consumer Goods2003Q2","Europe2003Q2","Fritz Klein2003Q2","Product22003Q2"]
["Customer475","Services","North America","Product4",600,961,"Q1",2005,"Porter Le","2005Q1","Services2005Q1","North America2005Q1","Porter Le2005Q1","Product42005Q1"]
["Customer476","Services","North America","Entera CRM",550,67,"Q3",2006,"Porter Le","2006Q3","Services2006Q3","North America2006Q3","Porter Le2006Q3","Entera CRM2006Q3"]
["Customer477","Finance","North America","Entera CRM",350,216,"Q2",2005,"Porter Le","2005Q2","Finance2005Q2","North America2005Q2","Porter Le2005Q2","Entera CRM2005Q2"]
["Customer478","Materials","South America","Product2",100,773,"Q1",2003,"Nasim Hanson","2003Q1","Materials2003Q1","South America2003Q1","Nasim Hanson2003Q1","Product22003Q1"]
["Customer479","Finance","Europe","Product1",400,406,"Q3",2006,"Fritz Klein","2006Q3","Finance2006Q3","Europe2006Q3","Fritz Klein2006Q3","Product12006Q3"]
["Customer480","Finance","Europe","Product1",350,502,"Q3",2004,"Fritz Klein","2004Q3","Finance2004Q3","Europe2004Q3","Fritz Klein2004Q3","Product12004Q3"]
["Customer481","Finance","North America","Product3",300,876,"Q1",2004,"Porter Le","2004Q1","Finance2004Q1","North America2004Q1","Porter Le2004Q1","Product32004Q1"]
["Customer482","Materials","South America","Entera CRM",100,945,"Q4",2008,"Nasim Hanson","2008Q4","Materials2008Q4","South America2008Q4","Nasim Hanson2008Q4","Entera CRM2008Q4"]
["Customer483","Materials","South America","Entera CRM",100,509,"Q3",2007,"Nasim Hanson","2007Q3","Materials2007Q3","South America2007Q3","Nasim Hanson2007Q3","Entera CRM2007Q3"]
["Customer484","Services","North America","Product3",550,100,"Q2",2004,"Porter Le","2004Q2","Services2004Q2","North America2004Q2","Porter Le2004Q2","Product32004Q2"]
["Customer485","Industrial Goods","Asia Pacific","Product3",550,302,"Q2",2006,"Oren Chase","2006Q2","Industrial Goods2006Q2","Asia Pacific2006Q2","Oren Chase2006Q2","Product32006Q2"]
["Customer486","Services","North America","Product3",550,909,"Q3",2004,"Porter Le","2004Q3","Services2004Q3","North America2004Q3","Porter Le2004Q3","Product32004Q3"]
["Customer487","Finance","North America","Product2",400,155,"Q2",2006,"Porter Le","2006Q2","Finance2006Q2","North America2006Q2","Porter Le2006Q2","Product22006Q2"]
["Customer488","Finance","North America","Entera CRM",350,226,"Q2",2005,"Porter Le","2005Q2","Finance2005Q2","North America2005Q2","Porter Le2005Q2","Entera CRM2005Q2"]
["Customer489","Materials","Middle East","Product1",150,528,"Q4",2006,"Bradley Valenzuela","2006Q4","Materials2006Q4","Middle East2006Q4","Bradley Valenzuela2006Q4","Product12006Q4"]
["Customer490","Services","North America","Product1",550,401,"Q3",2007,"Porter Le","2007Q3","Services2007Q3","North America2007Q3","Porter Le2007Q3","Product12007Q3"]
["Customer491","Technology","Asia Pacific","Entera CRM",650,969,"Q1",2005,"Oren Chase","2005Q1","Technology2005Q1","Asia Pacific2005Q1","Oren Chase2005Q1","Entera CRM2005Q1"]
["Customer492","Utilities","North America","Product3",700,714,"Q1",2007,"Porter Le","2007Q1","Utilities2007Q1","North America2007Q1","Porter Le2007Q1","Product32007Q1"]
["Customer493","Utilities","North America","Product3",700,193,"Q2",2003,"Porter Le","2003Q2","Utilities2003Q2","North America2003Q2","Porter Le2003Q2","Product32003Q2"]
["Customer494","Technology","North America","Product4",650,389,"Q4",2003,"Porter Le","2003Q4","Technology2003Q4","North America2003Q4","Porter Le2003Q4","Product42003Q4"]
["Customer495","Utilities","North America","Product4",700,514,"Q4",2006,"Porter Le","2006Q4","Utilities2006Q4","North America2006Q4","Porter Le2006Q4","Product42006Q4"]
["Customer496","Consumer Goods","Asia Pacific","Product4",250,881,"Q1",2006,"Oren Chase","2006Q1","Consumer Goods2006Q1","Asia Pacific2006Q1","Oren Chase2006Q1","Product42006Q1"]
["Customer497","Healthcare","Europe","Product2",500,228,"Q1",2005,"Fritz Klein","2005Q1","Healthcare2005Q1","Europe2005Q1","Fritz Klein2005Q1","Product22005Q1"]
["Customer498","Finance","North America","Product1",350,826,"Q3",2006,"Porter Le","2006Q3","Finance2006Q3","North America2006Q3","Porter Le2006Q3","Product12006Q3"]
["Customer499","Services","North America","Product4",550,909,"Q3",2003,"Porter Le","2003Q3","Services2003Q3","North America2003Q3","Porter Le2003Q3","Product42003Q3"]
["Customer500","Technology","North America","Product1",650,819,"Q2",2007,"Porter Le","2007Q2","Technology2007Q2","North America2007Q2","Porter Le2007Q2","Product12007Q2"]
["Customer501","Materials","North America","Product2",100,704,"Q4",2006,"Porter Le","2006Q4","Materials2006Q4","North America2006Q4","Porter Le2006Q4","Product22006Q4"]
["Customer502","Utilities","North America","Product3",700,642,"Q2",2007,"Porter Le","2007Q2","Utilities2007Q2","North America2007Q2","Porter Le2007Q2","Product32007Q2"]
["Customer503","Healthcare","North America","Product2",500,423,"Q3",2007,"Porter Le","2007Q3","Healthcare2007Q3","North America2007Q3","Porter Le2007Q3","Product22007Q3"]

{"sheet":"Human Resources","index":6,"n_rows":102,"n_cols":8,"rows_kept":102,"cut":false,"hidden":true,"merged":[[0,2,0,7]]}
[null,null,"Previous Month Data"]
["Full Name","Hire Date","Salary","Bonus","Overtime","Department","Sick Days","Performance Score"]
["Fritz Klein","2014-12-05",20000,3130,220,"Finance",3,4]
["Porter Le","2015-04-28",29000,1800,810,"Administration",4,5]
["Oren Chase","2013-12-26",29000,2550,810,"Human Resources",1,1]
["Nasim Hanson","2015-02-25",30000,4430,840,"Finance",5,5]
["Bradley Valenzuela","2014-04-18",31000,1860,2220,"Marketing",3,3]
["Vaughan Dean","2015-02-28",31000,5550,60,"Marketing",5,4]
["Christopher Guerra","2014-02-20",32000,5250,60,"R&D",1,3]
["Ishmael Grimes","2013-12-20",32000,4690,1460,"Administration",1,2]
["Ferdinand Small","2014-01-23",34000,4350,3060,"Customer Support",3,3]
["Asher Benson","2013-11-20",34000,2850,1860,"Accounting",1,5]
["Marvin Velasquez","2014-10-09",35000,3840,370,"Administration",6,5]
["Tiger Schultz","2014-12-18",35000,2290,990,"Human Resources",2,4]
["Kasimir Mccoy","2014-01-29",36000,3290,60,"R&D",3,3]
["Oscar Keller","2014-02-21",36000,5210,700,"R&D",1,1]
["Lamar Howard","2014-11-18",38000,5470,2100,"Administration",5,3]
["Wesley Conner","2014-04-29",38000,5130,3120,"IT",5,1]
["Hu Frost","2014-01-15",39000,2800,1110,"Accounting",3,4]
["Luke Luna","2015-03-02",39000,4550,2160,"R&D",1,2]
["Hayes Gonzales","2015-03-26",39000,27050,60,"Sales",4,5]
["Bevis Whitfield","2015-06-25",40000,3570.0000000000005,1860,"Marketing",1,1]
["Connor Baxter","2014-09-06",42000,2950,60,"IT",1,3]
["Tiger Mcintosh","2014-10-25",43000,1830,450,"Marketing",4,3]
["Jerry Goodwin","2015-10-05",44000,6650.0000000000009,60,"Customer Support",6,5]
["Jasper Battle","2014-07-13",44000,2650,1660,"Finance",2,2]
["Malcolm Hutchinson","2015-09-09",45000,3100,1700,"Human Resources",1,2]
["Gabriel Ayala","2014-11-04",46000,3570,3840,"Accounting",5,4]
["Phelan Davidson","2015-04-07",47000,5780,60,"Sales",3,2]
["Gavin Bell","2015-08-23",47000,43050,60,"Sales",4,4]
["Hasad Faulkner","2014-03-31",48000,2370,940,"Finance",3,4]
["Hector Madden","2014-06-02",49000,38050,60,"Sales",2,5]
["Hyatt Edwards","2014-12-30",49000,6900,4560,"Administration",1,2]
["Oscar Emerson","2014-09-20",49000,1950,60,"IT",1,5]
["Bernard Wilkinson","2014-06-26",50000,3350,60,"Sales",6,2]
["Caldwell Shepherd","2014-05-22",51000,3870,530,"Human Resources",3,5]
["Damian Silva","2014-03-14",52000,6810,4860,"Accounting",2,3]
["Lawrence Hicks","2015-07-03",52000,4890,4380,"Finance",5,5]
["Deacon Whitaker","2015-09-22",52000,7770.0000000000009,2460,"Accounting",5,3]
["Brennan Ellison","2014-08-19",52000,7290,540,"Marketing",3,1]
["Linus Christian","2014-03-25",52000,5850,3420.0000000000005,"R&D",2,5]
["Elmo Abbott","2013-12-20",55000,7680,2100,"Human Resources",1,3]
["Kuame Griffith","2014-11-25",56000,2610,3700.0000000000005,"R&D",6,2]
["Henry Holcomb","2015-04-20",57000,36050,60,"Sales",5,5]
["Chandler Stevens","2013-11-07",57000,6350,590,"Marketing",2,1]
["Oscar Dickerson","2014-05-10",58000,6450,3840.0000000000005,"Administration",3,2]
["Cruz Chase","2014-03-29",58000,2670,4380,"Administration",1,2]
["Ralph Alvarez","2015-07-29",58000,6450,4920,"Accounting",3,5]
["Felix Boyle","2015-09-07",58000,9150,1680,"R&D",3,1]
["Brandon Mckenzie","2015-02-28",59000,2150,60,"IT",5,3]
["Ciaran Smith","2014-08-19",61000,5040,630,"Finance",3,3]
["Wayne Golden","2014-07-19",61000,6180,3480,"Marketing",6,1]
["Patrick Hawkins","2015-05-24",62000,6270,5280,"Finance",6,4]
["Adam Curtis","2014-05-19",63000,9900,60,"Human Resources",2,4]
["Aidan Tyler","2015-01-29",63000,6950,60,"IT",6,4]
["Clayton Riddle","2014-11-09",63000,6360,650,"IT",1,5]
["Tad Carson","2015-06-20",63000,8130,1240,"Customer Support",3,2]
["Stewart Wilcox","2014-10-28",64000,9450,60,"Sales",5,5]
["Barry Mccarthy","2014-06-15",66000,9110,3160,"R&D",6,5]
["Jonah Mcintyre","2014-04-01",66000,9110,1300,"Finance",5,2]
["Chester Baldwin","2015-07-20",67000,8610,4470,"IT",1,3]
["Dennis Nguyen","2015-03-03",67000,8610,60,"IT",3,2]
["Sean Stark","2015-06-08",67000,4200,3840,"Accounting",4,3]
["Brennan Walls","2014-04-23",68000,3610,60,"Administration",4,1]
["Marvin Moses","2013-11-26",68000,9370,5180,"Administration",5,1]
["Drake Dominguez","2014-04-18",68000,6810,60,"IT",1,3]
["Emerson Sellers","2014-08-07",69000,4950,60,"Marketing",6,5]
["Dustin Harris","2014-05-19",69000,2350,1360,"Human Resources",4,2]
["Clayton Cotton","2015-08-15",70000,3690,1380,"Accounting",1,3]
["Ferris Knight","2013-11-12",70000,2370,2040,"Marketing",3,4]
["Rashad Zimmerman","2014-10-24",71000,42050,60,"Sales",2,3]
["Noah Rowland","2014-02-02",71000,9090,3410,"Finance",3,1]
["Graham Gibbs","2015-03-24",72000,9890,5500,"Human Resources",3,3]
["Hyatt Rogers","2014-04-04",76000,3930,6540,"R&D",2,1]
["Gareth Wyatt","2014-07-27",76000,3210,2940,"Accounting",4,5]
["Geoffrey Small","2014-08-26",77000,2510,5170.0000000000009,"IT",6,1]
["Melvin Pickett","2013-11-07",78000,9190,2280,"Accounting",4,1]
["Kasper Riley","2015-06-01",79000,10800,1560,"Administration",4,1]
["Simon Pratt","2014-08-11",80000,8650,2340,"R&D",4,1]
["Rajah Weber","2014-04-11",81000,12600,60,"IT",4,4]
["Griffith Nielsen","2014-07-05",81000,6440.0000000000009,60,"R&D",6,1]
["Declan Larson","2014-09-02",81000,29050,60,"Sales",5,5]
["Sawyer Byers","2014-03-29",84000,53050,60,"Sales",5,5]
["Hashim Vazquez","2014-03-10",85000,5910,60,"Customer Support",3,5]
["Stone Bush","2014-12-28",87000,33050,60,"Sales",6,2]
["Harding Turner","2014-07-28",89000,2750,60,"IT",2,4]
["Jesse Barron","2013-11-12",89000,10400,60,"IT",1,5]
["Kenneth Booker","2015-06-29",89000,10400,60,"IT",4,4]
["Steel Stuart","2014-06-20",91000,8880,7890,"Customer Support",2,4]
["Darius Sandoval","2015-01-06",91000,14100,7020,"Marketing",4,1]
["Giacomo Parks","2014-06-03",93000,9060,60,"Marketing",3,3]
["Flynn Guthrie","2014-10-22",98000,6690,60,"Human Resources",3,1]
["Kenyon Petersen","2014-11-30",100000,5850,7740,"Finance",3,1]
["Dexter Hawkins","2014-10-07",109000,16800,60,"R&D",4,3]
["Garrison Bray","2015-09-16",114000,7650,5560,"Administration",3,5]
["Kermit Duffy","2014-06-28",123000,11760,4820,"R&D",5,2]
["Eaton Stevens","2014-08-30",127000,18270,4980,"Administration",5,2]
["Judah Suarez","2014-04-22",149000,17000,5860,"Administration",5,4]
["Judah Robles","2014-03-07",81000,12600,60,"IT",4,1]
["Byron Foreman","2014-01-08",81000,6440.0000000000009,60,"R&D",3,3]
["Wylie Burris","2014-04-23",81000,29050,60,"Sales",2,5]
["Rafael Griffith","2015-06-09",84000,53050,60,"Sales",2,1]

{"sheet":"Stock Performance","index":7,"n_rows":102,"n_cols":7,"rows_kept":102,"cut":false,"hidden":true,"merged":[[0,2,0,6]]}
[null,null,"Close of trading Data"]
["Company Name","Ticker","Prev. Close","Last Trade","Move","%","Volume"]
["Tincidunt Orci Quis Inc.","A1",11.58,11.25,-0.33,-2.8497409326424871E-2,22887335]
["Dapibus Rutrum Justo Associates","A2",48.68,49.27,0.59,1.2119967132292521E-2,6045029]
["Elit Foundation","A3",64.150000000000006,63.56,-0.59,-9.1971940763834747E-3,3431623]
["Ante Institute","A4",6.99,6.9,-0.09,-1.2875536480686695E-2,142828633]
["Eget Mollis Lectus Industries","A5",84.6,83.66,-0.94,-1.1111111111111112E-2,8999757]
["Ligula Limited","A6",16.510000000000002,16.53,0.02,1.2113870381586917E-3,48834995]
["A LLC","A7",98.710000000000008,97.79,-0.92,-9.3202309796373214E-3,8660497]
["At Risus Nunc Inc.","A8",46.38,45.96,-0.42,-9.0556274256144882E-3,6683579]
["Ultricies Ornare Foundation","A9",32.510000000000005,32.31,-0.2,-6.1519532451553361E-3,10117721]
["Praesent Eu Nulla Consulting","A10",16.18,16.04,-0.14000000000000001,-8.6526576019777517E-3,56239906]
["Ullamcorper Nisl Arcu Limited","A11",34.35,34.81,0.46,1.3391557496360991E-2,13980262]
["Vehicula Risus Company","A12",22.91,22.47,-0.44,-1.9205587079877781E-2,25847555]
["Purus Ac Tellus Corporation","A13",173.13,174.72,1.59,9.1838502859123202E-3,6209893]
["Vestibulum Ante Ipsum Consulting","A14",21.93,22.2,0.27,1.2311901504787963E-2,71497500]
["Mauris Molestie Industries","A15",64.14,64.22,0.08,1.2472715933894605E-3,10874749]
["Nam Interdum PC","A16",32.49,32.25,-0.24,-7.386888273314865E-3,34089368]
["Ornare In Faucibus Industries","A17",34.870000000000005,34.520000000000003,-0.35,-1.0037281330656723E-2,9361703]
["Vel Company","A18",70.490000000000009,70.650000000000006,0.16,2.2698255071641367E-3,9157066]
["Nunc Mauris Inc.","A19",88.81,89.31,0.5,5.6299966220020262E-3,7942201]
["A Corp.","A20",79.209999999999994,79.209999999999994,0,0,3914774]
["Penatibus Ltd","A21",32.25,32.5,0.25,7.7519379844961239E-3,13765682]
["Integer In Magna Industries","A22",27.21,26.98,-0.23,-8.4527747151782427E-3,49211857]
["Donec Feugiat Metus Company","A23",18.059999999999999,18.239999999999998,0.18,9.9667774086378749E-3,52085580]
["Lacinia LLC","A24",63.809999999999995,64.08,0.27,4.2313117066290554E-3,8215733]
["In Inc.","A25",28.580000000000002,28.85,0.27,9.447165850244927E-3,20648122]
["Odio Etiam Company","A26",49.9,50.42,0.52,1.0420841683366735E-2,6444435]
["Gravida LLC","A27",75.550000000000011,76.010000000000005,0.46,6.0886829913964257E-3,5783255]
["Metus Urna Foundation","A28",36.279999999999994,36.409999999999997,0.13,3.5832414553472994E-3,13682491]
["Nonummy Ultricies Incorporated","A29",52.449999999999996,52.29,-0.16,-3.0505243088655865E-3,8421143]
["Nunc LLP","A30",73.7,74.010000000000005,0.31,4.2062415196743551E-3,20421064]
["Suspendisse Tristique Neque Corporation","A31",11.58,11.25,-0.33,-2.8497409326424871E-2,22887335]
["Arcu Industries","A32",48.68,49.27,0.59,1.2119967132292521E-2,6045029]
["Sit Inc.","A33",64.150000000000006,63.56,-0.59,-9.1971940763834747E-3,3431623]
["Lectus Ante Inc.","A34",6.99,6.9,-0.09,-1.2875536480686695E-2,142828633]
["Luctus Ut Pellentesque Institute","A35",84.6,83.66,-0.94,-1.1111111111111112E-2,8999757]
["Adipiscing Corp.","A36",16.510000000000002,16.53,0.02,1.2113870381586917E-3,48834995]
["Molestie Arcu Limited","A37",98.710000000000008,97.79,-0.92,-9.3202309796373214E-3,8660497]
["Eu LLC","A38",46.38,45.96,-0.42,-9.0556274256144882E-3,6683579]
["Auctor Associates","A39",32.510000000000005,32.31,-0.2,-6.1519532451553361E-3,10117721]
["Nullam LLP","A40",16.18,16.04,-0.14000000000000001,-8.6526576019777517E-3,56239906]
["Donec Est Consulting","A41",34.35,34.81,0.46,1.3391557496360991E-2,13980262]
["A LLP","A42",22.91,22.47,-0.44,-1.9205587079877781E-2,25847555]
["Tristique Associates","A43",173.13,174.72,1.59,9.1838502859123202E-3,6209893]
["Faucibus Orci Luctus LLP","A44",21.93,22.2,0.27,1.2311901504787963E-2,71497500]
["Arcu Corp.","A45",64.14,64.22,0.08,1.2472715933894605E-3,10874749]
["Per Associates","A46",32.49,32.25,-0.24,-7.386888273314865E-3,34089368]
["Sed Consequat Auctor Institute","A47",34.870000000000005,34.520000000000003,-0.35,-1.0037281330656723E-2,9361703]
["Accumsan Convallis Associates","A48",70.490000000000009,70.650000000000006,0.16,2.2698255071641367E-3,9157066]
["Imperdiet Institute","A49",88.81,89.31,0.5,5.6299966220020262E-3,7942201]
["Cubilia Curae; Donec Consulting","A50",79.209999999999994,79.209999999999994,0,0,3914774]
["Ultricies Incorporated","A51",32.25,32.5,0.25,7.7519379844961239E-3,13765682]
["Odio Incorporated","A52",27.21,26.98,-0.23,-8.4527747151782427E-3,49211857]
["Nunc Laoreet Lectus Associates","A53",18.059999999999999,18.239999999999998,0.18,9.9667774086378749E-3,52085580]
["Fermentum Metus Aenean Corporation","A54",63.809999999999995,64.08,0.27,4.2313117066290554E-3,8215733]
["Tempor Augue Ac Associates","A55",28.580000000000002,28.85,0.27,9.447165850244927E-3,20648122]
["Et Tristique Pellentesque Foundation","A56",49.9,50.42,0.52,1.0420841683366735E-2,6444435]
["Montes Corporation","A57",75.550000000000011,76.010000000000005,0.46,6.0886829913964257E-3,5783255]
["Eu Ligula Aenean PC","A58",36.279999999999994,36.409999999999997,0.13,3.5832414553472994E-3,13682491]
["Sed Industries","A59",52.449999999999996,52.29,-0.16,-3.0505243088655865E-3,8421143]
["Tincidunt Vehicula Institute","A60",73.7,74.010000000000005,0.31,4.2062415196743551E-3,20421064]
["Ultrices LLP","A61",11.58,11.25,-0.33,-2.8497409326424871E-2,22887335]
["Aliquam Adipiscing LLC","A62",48.68,49.27,0.59,1.2119967132292521E-2,6045029]
["Sed PC","A63",64.150000000000006,63.56,-0.59,-9.1971940763834747E-3,3431623]
["Dis Parturient Montes Limited","A64",6.99,6.9,-0.09,-1.2875536480686695E-2,142828633]
["Duis Cursus Incorporated","A65",84.6,83.66,-0.94,-1.1111111111111112E-2,8999757]
["Ipsum Leo Elementum Corporation","A66",16.510000000000002,16.53,0.02,1.2113870381586917E-3,48834995]
["Mauris LLP","A67",98.710000000000008,97.79,-0.92,-9.3202309796373214E-3,8660497]
["Sed Hendrerit LLC","A68",46.38,45.96,-0.42,-9.0556274256144882E-3,6683579]
["Sociis Foundation","A69",32.510000000000005,32.31,-0.2,-6.1519532451553361E-3,10117721]
["A Auctor Consulting","A70",16.18,16.04,-0.14000000000000001,-8.6526576019777517E-3,56239906]
["Porttitor Incorporated","A71",34.35,34.81,0.46,1.3391557496360991E-2,13980262]
["Interdum LLC","A72",22.91,22.47,-0.44,-1.9205587079877781E-2,25847555]
["Congue PC","A73",173.13,174.72,1.59,9.1838502859123202E-3,6209893]
["Per Inceptos Associates","A74",21.93,22.2,0.27,1.2311901504787963E-2,71497500]
["Semper LLP","A75",64.14,64.22,0.08,1.2472715933894605E-3,10874749]
["Vestibulum Lorem Company","A76",32.49,32.25,-0.24,-7.386888273314865E-3,34089368]
["Faucibus Lectus A LLP","A77",34.870000000000005,34.520000000000003,-0.35,-1.0037281330656723E-2,9361703]
["Porttitor Tellus PC","A78",70.490000000000009,70.650000000000006,0.16,2.2698255071641367E-3,9157066]
["Odio Tristique Pharetra Inc.","A79",88.81,89.31,0.5,5.6299966220020262E-3,7942201]
["In Ornare Limited","A80",79.209999999999994,79.209999999999994,0,0,3914774]
["Sit Amet Metus Institute","A81",32.25,32.5,0.25,7.7519379844961239E-3,13765682]
["Eget Company","A82",27.21,26.98,-0.23,-8.4527747151782427E-3,49211857]
["Non Lacinia Industries","A83",18.059999999999999,18.239999999999998,0.18,9.9667774086378749E-3,52085580]
["Vel Arcu Ltd","A84",63.809999999999995,64.08,0.27,4.2313117066290554E-3,8215733]
["Sapien Corp.","A85",28.580000000000002,28.85,0.27,9.447165850244927E-3,20648122]
["Nullam Feugiat Associates","A86",49.9,50.42,0.52,1.0420841683366735E-2,6444435]
["Eros Turpis PC","A87",75.550000000000011,76.010000000000005,0.46,6.0886829913964257E-3,5783255]
["Ac Mi Eleifend Consulting","A88",36.279999999999994,36.409999999999997,0.13,3.5832414553472994E-3,13682491]
["Amet Risus Donec Incorporated","A89",52.449999999999996,52.29,-0.16,-3.0505243088655865E-3,8421143]
["Ultricies Dignissim Lacus Consulting","A90",73.7,74.010000000000005,0.31,4.2062415196743551E-3,20421064]
["Blandit Congue LLC","A91",11.58,11.25,-0.33,-2.8497409326424871E-2,22887335]
["Neque Vitae Semper Industries","A92",48.68,49.27,0.59,1.2119967132292521E-2,6045029]
["Vestibulum Ante Ipsum Institute","A93",64.150000000000006,63.56,-0.59,-9.1971940763834747E-3,3431623]
["Tristique Pellentesque Ltd","A94",6.99,6.9,-0.09,-1.2875536480686695E-2,142828633]
["Et Commodo At LLP","A95",84.6,83.66,-0.94,-1.1111111111111112E-2,8999757]
["Sed Pharetra Corp.","A96",16.510000000000002,16.53,0.02,1.2113870381586917E-3,48834995]
["Accumsan Convallis Ltd","A97",98.710000000000008,97.79,-0.92,-9.3202309796373214E-3,8660497]
["Luctus Ut Pellentesque LLC","A98",46.38,45.96,-0.42,-9.0556274256144882E-3,6683579]
["Semper Pretium Inc.","A99",32.510000000000005,32.31,-0.2,-6.1519532451553361E-3,10117721]
["Natoque Penatibus Et Consulting","A100",16.18,16.04,-0.14000000000000001,-8.6526576019777517E-3,56239906]

{"sheet":"Lkup","index":8,"n_rows":43,"n_cols":3,"rows_kept":43,"cut":false,"hidden":false,"merged":[]}
["ID","Description","Type"]
["Product 1","Touchscreen Laptop","Product"]
["Product 2","Hybrid Laptop","Product"]
["Product 3","Powerhouse Laptop","Product"]
["Product 4","Thin Laptop","Product"]
["Product 5","Economy Laptop","Product"]
["Product 6","Series 8000 Tablet","Product"]
["Product 7","Series 5000 Tablet","Product"]
["Product 8","Hybrid Laptop LED","Product"]
["Product 9","Elite Laptop","Product"]
["Product 10","All-in-one Desktop","Product"]
["Product 11","Gamer's Desktop","Product"]
["Product 12","Elite Desktop","Product"]
["Customer 1","College Student","Customer Type"]
["Customer 2","Post Graduate Student","Customer Type"]
["Customer 3","Full-time Parent","Customer Type"]
["Customer 4","Self-Employed","Customer Type"]
["Customer 5","Full-time Employee","Customer Type"]
["Customer 6","Business Owner","Customer Type"]
["Customer 7","Maintstream Youth","Customer Type"]
["Customer 8","Retired","Customer Type"]
["Customer 9","Government","Customer Type"]
["Customer 10","Military","Customer Type"]
["Customer 11","Corporation","Customer Type"]
["Customer 12","NPO/NGO","Customer Type"]
["Person 1","Bo Kornegay","Salesperson"]
["Person 2","Britta Blakley","Salesperson"]
["Person 3","Brock Stalder","Salesperson"]
["Person 4","Catherine Shoaff","Salesperson"]
["Person 5","Fermin Quin","Salesperson"]
["Person 6","Glenda Harbaugh","Salesperson"]
["Person 7","Jarrett Rimmer","Salesperson"]
["Person 8","Li Bruni","Salesperson"]
["Person 9","Linwood Camargo","Salesperson"]
["Person 10","Norene McNeece","Salesperson"]
["Person 11","Rick Boehm","Salesperson"]
["Person 12","Sueann Olivero","Salesperson"]
[]
["Dropdown"]
["by Product"]
["by Region"]
["by Salesperson"]
["by Customer Type"]