{"text_format":"1","workbook":"xlsx","n_sheets":9,"sheets":["Team Performance","Dashboard","Sales Dashboard","Sum Over Time","Sums","Financial Dashboard","Human Resources","Stock Performance","Lkup"],"not_rendered":{"charts":3,"images":1,"macros":1,"external_links":0,"defined_names":23,"comments":0,"pivot_tables":0},"unopened":[],"bounds":{"document_bytes":16777216,"sheet_cells":100000,"rows_first":2000,"rows_last":500,"rows_between":2000,"halvings":0,"cell_chars":16384,"cell_head_chars":4096},"cells_cut":0,"cells_raw":0,"read":"whole","date_system":"1900"}

{"sheet":"Team Performance","index":0,"n_rows":103,"n_cols":19,"rows_kept":103,"cut":false,"hidden":true,"merged":[]}
["Team","Team Members","Product","Sale Date","Region","Login Hours","Total Talk Time","Total Hold Time","Sales","Sales Per Hour","Revenue","Revenue Per Hour","Calls","Excellent","Good","Fair","Poor","Total","CSAT% (Customer Satisfaction)"]
["Team A","Sydnee","Product 1","2014-06-01","Alabama",7,6,0.5,22,3.1428571428571428,748,106.85714285714286,358,24,40,32,15,{"$f":"SUM(M2:Q2)","v":469},{"$f":"SUM(N2:O2)/R2","v":0.13646055437100213}]
["Team A","Amber","Product 2","2014-06-01","California",7.5,6.5,0.70000000000000018,19,2.5333333333333332,646,86.13333333333334,323,20,35,34,15,{"$f":"SUM(M3:Q3)","v":427},{"$f":"SUM(N3:O3)/R3","v":0.1288056206088993}]
["Team A","Constance","Product 1","2014-06-01","Colorado",8,7,0.3,16,2,544,68,310,29,32,30,11,412,0.14805825242718446]
["Team A","Nola","Product 2","2014-06-01","Connecticut",8.3000000000000007,7.3000000000000007,0.8,21,2.5301204819277108,714,86.024096385542165,327,25,36,33,12,433,0.14087759815242495]
["Team A","Libby","Product 1","2014-06-01","Florida",7.3,6.3,0.2,23,3.1506849315068495,782,107.12328767123287,367,27,37,36,12,479,0.1336116910229645]
["Team A","Tashya","Product 2","2014-06-01","Hawaii",7.9,6.9,0.6,24,3.0379746835443036,816,103.29113924050633,379,23,37,33,11,483,0.12422360248447205]
["Team A","Flavia","Product 1","2014-06-01","Alabama",7.6,6.6,0.5,15,1.9736842105263159,510,67.10526315789474,302,24,37,33,12,408,0.14950980392156862]
["Team A","Guinevere","Product 2","2014-06-01","California",7,6,0.70000000000000018,19,2.7142857142857144,646,92.285714285714292,380,21,32,33,11,477,0.1111111111111111]
["Team A","Darryl","Product 1","2014-06-01","Colorado",7.5,6.5,0.3,20,2.6666666666666665,680,90.666666666666671,394,30,38,35,13,510,0.13333333333333333]
{"$rows_left_out":94}
{"sheet":"Dashboard","index":1,"n_rows":24,"n_cols":10,"rows_kept":24,"cut":false,"hidden":false,"merged":[[23,9,23,10],[0,0,0,11],[16,0,16,1]]}
["Cobrahouse Computers, Inc.\n2011/2012 Sales Dashboard"]
["Total Sales","by Customer Type"]
[{"$f":"MID(B2,4,25)","v":"Customer Type"},"Total Sales"]
["Full-time Employee",237110]
["Maintstream Youth",236950]
["NPO/NGO",235282]
["Military",235131]
["Post Graduate Student",234674]
["Full-time Parent",229290]
["Self-Employed",225617]
{"$rows_left_out":15}
{"sheet":"Sales Dashboard","index":2,"n_rows":146,"n_cols":40,"rows_kept":146,"cut":false,"hidden":false,"merged":[[0,4,0,27],[0,28,0,39]]}
[null,null,null,null,"Sales",null,null,null,null,null,null,null,null,null,null,null,null,null,null,null,null,null,null,null,null,null,null,null,"Additional Columns"]
["Region","Product","Customer Type0","Sales Person - Name","2011-01-01","2011-02-01","2011-03-01","2011-04-01","2011-05-01","2011-06-01","2011-07-01","2011-08-01","2011-09-01","2011-10-01","2011-11-01","2011-12-01","2012-01-01","2012-02-01","2012-03-01","2012-04-01","2012-05-01","2012-06-01","2012-07-01","2012-08-01","2012-09-01","2012-10-01","2012-11-01","2012-12-01","Total","Product Name","Customer Type","Salesperson","Q1 2011","Q2 2011","Q3 2011","Q4 2011","Q1 2012","Q2 2012","Q3 2012","Q4 2012"]
["Region 1","Product 1","Customer 1","Person 1",717,641,654,752,595,769,793,710,564,677,619,723,639,757,746,758,562,563,782,559,640,669,774,692,{"$f":"SUM(E3:AB3)","v":16355},{"$f":"VLOOKUP(B3,Lkup!$A$2:$B$100,2,FALSE)","v":"Touchscreen Laptop"},{"$f":"VLOOKUP(C3,Lkup!$A$2:$B$100,2,FALSE)","v":"College Student"},{"$f":"VLOOKUP(D3,Lkup!$A$2:$B$100,2,FALSE)","v":"Bo Kornegay"},{"$f":"SUM(E3:G3)","v":2012},{"$f":"SUM(H3:J3)","v":2116},{"$f":"SUM(K3:M3)","v":2067},{"$f":"SUM(N3:P3)","v":2019},{"$f":"SUM(Q3:S3)","v":2142},{"$f":"SUM(T3:V3)","v":1883},{"$f":"SUM(W3:Y3)","v":1981},{"$f":"SUM(Z3:AB3)","v":2135}]
["Region 1","Product 1","Customer 2","Person 2",1400,1220,1114,899,1351,835,873,909,888,1278,1350,1348,931,1298,1164,800,903,958,836,909,853,918,1223,886,{"$f":"SUM(E4:AB4)","v":25144},{"$f":"VLOOKUP(B4,Lkup!$A$2:$B$100,2,FALSE)","v":"Touchscreen Laptop"},{"$f":"VLOOKUP(C4,Lkup!$A$2:$B$100,2,FALSE)","v":"Post Graduate Student"},{"$f":"VLOOKUP(D4,Lkup!$A$2:$B$100,2,FALSE)","v":"Britta Blakley"},{"$f":"SUM(E4:G4)","v":3734},{"$f":"SUM(H4:J4)","v":3085},{"$f":"SUM(K4:M4)","v":2670},{"$f":"SUM(N4:P4)","v":3976},{"$f":"SUM(Q4:S4)","v":3393},{"$f":"SUM(T4:V4)","v":2661},{"$f":"SUM(W4:Y4)","v":2598},{"$f":"SUM(Z4:AB4)","v":3027}]
["Region 1","Product 1","Customer 3","Person 3",696,643,644,596,645,649,612,675,794,591,709,561,733,771,792,577,586,727,678,753,652,689,767,643,16183,{"$f":"VLOOKUP(B5,Lkup!$A$2:$B$100,2,FALSE)","v":"Touchscreen Laptop"},{"$f":"VLOOKUP(C5,Lkup!$A$2:$B$100,2,FALSE)","v":"Full-time Parent"},{"$f":"VLOOKUP(D5,Lkup!$A$2:$B$100,2,FALSE)","v":"Brock Stalder"},1983,1890,2081,1861,2296,1890,2083,2099]
["Region 1","Product 1","Customer 4","Person 4",732,628,628,667,819,640,850,755,612,644,622,881,854,766,713,784,667,711,733,677,637,815,756,693,17284,{"$f":"VLOOKUP(B6,Lkup!$A$2:$B$100,2,FALSE)","v":"Touchscreen Laptop"},{"$f":"VLOOKUP(C6,Lkup!$A$2:$B$100,2,FALSE)","v":"Self-Employed"},{"$f":"VLOOKUP(D6,Lkup!$A$2:$B$100,2,FALSE)","v":"Catherine Shoaff"},1988,2126,2217,2147,2333,2162,2047,2264]
["Region 1","Product 1","Customer 5","Person 5",607,602,636,869,847,806,895,835,843,799,834,785,744,858,799,677,867,605,828,620,655,704,784,635,18134,{"$f":"VLOOKUP(B7,Lkup!$A$2:$B$100,2,FALSE)","v":"Touchscreen Laptop"},{"$f":"VLOOKUP(C7,Lkup!$A$2:$B$100,2,FALSE)","v":"Full-time Employee"},{"$f":"VLOOKUP(D7,Lkup!$A$2:$B$100,2,FALSE)","v":"Fermin Quin"},1845,2522,2573,2418,2401,2149,2103,2123]
["Region 1","Product 1","Customer 6","Person 6",800,607,737,621,660,733,743,666,630,644,617,695,653,648,788,731,710,745,788,756,627,669,731,650,16649,{"$f":"VLOOKUP(B8,Lkup!$A$2:$B$100,2,FALSE)","v":"Touchscreen Laptop"},{"$f":"VLOOKUP(C8,Lkup!$A$2:$B$100,2,FALSE)","v":"Business Owner"},{"$f":"VLOOKUP(D8,Lkup!$A$2:$B$100,2,FALSE)","v":"Glenda Harbaugh"},2144,2014,2039,1956,2089,2186,2171,2050]
["Region 1","Product 1","Customer 7","Person 7",1064,863,1316,1141,933,872,1185,1358,1173,1343,1164,1275,1364,828,1299,863,910,1146,915,941,1093,1224,938,946,26154,{"$f":"VLOOKUP(B9,Lkup!$A$2:$B$100,2,FALSE)","v":"Touchscreen Laptop"},{"$f":"VLOOKUP(C9,Lkup!$A$2:$B$100,2,FALSE)","v":"Maintstream Youth"},{"$f":"VLOOKUP(D9,Lkup!$A$2:$B$100,2,FALSE)","v":"Jarrett Rimmer"},3243,2946,3716,3782,3491,2919,2949,3108]
["Region 1","Product 1","Customer 8","Person 8",667,609,780,559,673,727,730,550,787,609,762,604,555,747,640,649,565,725,602,594,799,721,786,589,16029,{"$f":"VLOOKUP(B10,Lkup!$A$2:$B$100,2,FALSE)","v":"Touchscreen Laptop"},{"$f":"VLOOKUP(C10,Lkup!$A$2:$B$100,2,FALSE)","v":"Retired"},{"$f":"VLOOKUP(D10,Lkup!$A$2:$B$100,2,FALSE)","v":"Li Bruni"},2056,1959,2067,1975,1942,1939,1995,2096]
{"$rows_left_out":137}
{"sheet":"Sum Over Time","index":3,"n_rows":14,"n_cols":9,"rows_kept":14,"cut":false,"hidden":false,"merged":[]}
["Region:",{"$f":"Dashboard!C17","v":"All Regions"}]
["Product","Q1 2011","Q2 2011","Q3 2011","Q4 2011","Q1 2012","Q2 2012","Q3 2012","Q4 2012"]
["All-in-one Desktop",{"$f":"SUM(IF(products=$A3,IF($B$1=\"All Regions\",qtr1_2011,IF(region=$B$1,qtr1_2011))))","v":28204},{"$f":"SUM(IF(products=$A3,IF($B$1=\"All Regions\",qtr2_2011,IF(region=$B$1,qtr2_2011))))","v":27903},{"$f":"SUM(IF(products=$A3,IF($B$1=\"All Regions\",qtr3_2011,IF(region=$B$1,qtr3_2011))))","v":28621},{"$f":"SUM(IF(products=$A3,IF($B$1=\"All Regions\",qtr4_2011,IF(region=$B$1,qtr4_2011))))","v":28086},{"$f":"SUM(IF(products=$A3,IF($B$1=\"All Regions\",qtr1_2012,IF(region=$B$1,qtr1_2012))))","v":28304},{"$f":"SUM(IF(products=$A3,IF($B$1=\"All Regions\",qtr2_2012,IF(region=$B$1,qtr2_2012))))","v":28839},{"$f":"SUM(IF(products=$A3,IF($B$1=\"All Regions\",qtr3_2012,IF(region=$B$1,qtr3_2012))))","v":28942},{"$f":"SUM(IF(products=$A3,IF($B$1=\"All Regions\",qtr4_2012,IF(region=$B$1,qtr4_2012))))","v":29270}]
["Economy Laptop",{"$f":"SUM(IF(products=$A4,IF($B$1=\"All Regions\",qtr1_2011,IF(region=$B$1,qtr1_2011))))","v":28976},{"$f":"SUM(IF(products=$A4,IF($B$1=\"All Regions\",qtr2_2011,IF(region=$B$1,qtr2_2011))))","v":28811},{"$f":"SUM(IF(products=$A4,IF($B$1=\"All Regions\",qtr3_2011,IF(region=$B$1,qtr3_2011))))","v":29222},{"$f":"SUM(IF(products=$A4,IF($B$1=\"All Regions\",qtr4_2011,IF(region=$B$1,qtr4_2011))))","v":28074},{"$f":"SUM(IF(products=$A4,IF($B$1=\"All Regions\",qtr1_2012,IF(region=$B$1,qtr1_2012))))","v":28066},{"$f":"SUM(IF(products=$A4,IF($B$1=\"All Regions\",qtr2_2012,IF(region=$B$1,qtr2_2012))))","v":28908},{"$f":"SUM(IF(products=$A4,IF($B$1=\"All Regions\",qtr3_2012,IF(region=$B$1,qtr3_2012))))","v":27625},{"$f":"SUM(IF(products=$A4,IF($B$1=\"All Regions\",qtr4_2012,IF(region=$B$1,qtr4_2012))))","v":28207}]
["Elite Desktop",{"$f":"SUM(IF(products=$A5,IF($B$1=\"All Regions\",qtr1_2011,IF(region=$B$1,qtr1_2011))))","v":27593},{"$f":"SUM(IF(products=$A5,IF($B$1=\"All Regions\",qtr2_2011,IF(region=$B$1,qtr2_2011))))","v":27564},{"$f":"SUM(IF(products=$A5,IF($B$1=\"All Regions\",qtr3_2011,IF(region=$B$1,qtr3_2011))))","v":27686},{"$f":"SUM(IF(products=$A5,IF($B$1=\"All Regions\",qtr4_2011,IF(region=$B$1,qtr4_2011))))","v":27523},{"$f":"SUM(IF(products=$A5,IF($B$1=\"All Regions\",qtr1_2012,IF(region=$B$1,qtr1_2012))))","v":28851},{"$f":"SUM(IF(products=$A5,IF($B$1=\"All Regions\",qtr2_2012,IF(region=$B$1,qtr2_2012))))","v":28381},{"$f":"SUM(IF(products=$A5,IF($B$1=\"All Regions\",qtr3_2012,IF(region=$B$1,qtr3_2012))))","v":28047},{"$f":"SUM(IF(products=$A5,IF($B$1=\"All Regions\",qtr4_2012,IF(region=$B$1,qtr4_2012))))","v":28356}]
["Elite Laptop",{"$f":"SUM(IF(products=$A6,IF($B$1=\"All Regions\",qtr1_2011,IF(region=$B$1,qtr1_2011))))","v":28059},{"$f":"SUM(IF(products=$A6,IF($B$1=\"All Regions\",qtr2_2011,IF(region=$B$1,qtr2_2011))))","v":29530},{"$f":"SUM(IF(products=$A6,IF($B$1=\"All Regions\",qtr3_2011,IF(region=$B$1,qtr3_2011))))","v":29262},{"$f":"SUM(IF(products=$A6,IF($B$1=\"All Regions\",qtr4_2011,IF(region=$B$1,qtr4_2011))))","v":29268},{"$f":"SUM(IF(products=$A6,IF($B$1=\"All Regions\",qtr1_2012,IF(region=$B$1,qtr1_2012))))","v":29165},{"$f":"SUM(IF(products=$A6,IF($B$1=\"All Regions\",qtr2_2012,IF(region=$B$1,qtr2_2012))))","v":28809},{"$f":"SUM(IF(products=$A6,IF($B$1=\"All Regions\",qtr3_2012,IF(region=$B$1,qtr3_2012))))","v":29791},{"$f":"SUM(IF(products=$A6,IF($B$1=\"All Regions\",qtr4_2012,IF(region=$B$1,qtr4_2012))))","v":29818}]
["Gamer's Desktop",{"$f":"SUM(IF(products=$A7,IF($B$1=\"All Regions\",qtr1_2011,IF(region=$B$1,qtr1_2011))))","v":29430},{"$f":"SUM(IF(products=$A7,IF($B$1=\"All Regions\",qtr2_2011,IF(region=$B$1,qtr2_2011))))","v":29657},{"$f":"SUM(IF(products=$A7,IF($B$1=\"All Regions\",qtr3_2011,IF(region=$B$1,qtr3_2011))))","v":29353},{"$f":"SUM(IF(products=$A7,IF($B$1=\"All Regions\",qtr4_2011,IF(region=$B$1,qtr4_2011))))","v":29713},{"$f":"SUM(IF(products=$A7,IF($B$1=\"All Regions\",qtr1_2012,IF(region=$B$1,qtr1_2012))))","v":29892},{"$f":"SUM(IF(products=$A7,IF($B$1=\"All Regions\",qtr2_2012,IF(region=$B$1,qtr2_2012))))","v":29019},{"$f":"SUM(IF(products=$A7,IF($B$1=\"All Regions\",qtr3_2012,IF(region=$B$1,qtr3_2012))))","v":29240},{"$f":"SUM(IF(products=$A7,IF($B$1=\"All Regions\",qtr4_2012,IF(region=$B$1,qtr4_2012))))","v":29799}]
["Hybrid Laptop",{"$f":"SUM(IF(products=$A8,IF($B$1=\"All Regions\",qtr1_2011,IF(region=$B$1,qtr1_2011))))","v":27328},{"$f":"SUM(IF(products=$A8,IF($B$1=\"All Regions\",qtr2_2011,IF(region=$B$1,qtr2_2011))))","v":28624},{"$f":"SUM(IF(products=$A8,IF($B$1=\"All Regions\",qtr3_2011,IF(region=$B$1,qtr3_2011))))","v":28842},{"$f":"SUM(IF(products=$A8,IF($B$1=\"All Regions\",qtr4_2011,IF(region=$B$1,qtr4_2011))))","v":27598},{"$f":"SUM(IF(products=$A8,IF($B$1=\"All Regions\",qtr1_2012,IF(region=$B$1,qtr1_2012))))","v":27807},{"$f":"SUM(IF(products=$A8,IF($B$1=\"All Regions\",qtr2_2012,IF(region=$B$1,qtr2_2012))))","v":27671},{"$f":"SUM(IF(products=$A8,IF($B$1=\"All Regions\",qtr3_2012,IF(region=$B$1,qtr3_2012))))","v":27990},{"$f":"SUM(IF(products=$A8,IF($B$1=\"All Regions\",qtr4_2012,IF(region=$B$1,qtr4_2012))))","v":28015}]
["Powerhouse Laptop",{"$f":"SUM(IF(products=$A9,IF($B$1=\"All Regions\",qtr1_2011,IF(region=$B$1,qtr1_2011))))","v":28156},{"$f":"SUM(IF(products=$A9,IF($B$1=\"All Regions\",qtr2_2011,IF(region=$B$1,qtr2_2011))))","v":28360},{"$f":"SUM(IF(products=$A9,IF($B$1=\"All Regions\",qtr3_2011,IF(region=$B$1,qtr3_2011))))","v":27778},{"$f":"SUM(IF(products=$A9,IF($B$1=\"All Regions\",qtr4_2011,IF(region=$B$1,qtr4_2011))))","v":27129},{"$f":"SUM(IF(products=$A9,IF($B$1=\"All Regions\",qtr1_2012,IF(region=$B$1,qtr1_2012))))","v":28003},{"$f":"SUM(IF(products=$A9,IF($B$1=\"All Regions\",qtr2_2012,IF(region=$B$1,qtr2_2012))))","v":28645},{"$f":"SUM(IF(products=$A9,IF($B$1=\"All Regions\",qtr3_2012,IF(region=$B$1,qtr3_2012))))","v":28739},{"$f":"SUM(IF(products=$A9,IF($B$1=\"All Regions\",qtr4_2012,IF(region=$B$1,qtr4_2012))))","v":29290}]
["Series 5000 Tablet",{"$f":"SUM(IF(products=$A10,IF($B$1=\"All Regions\",qtr1_2011,IF(region=$B$1,qtr1_2011))))","v":27279},{"$f":"SUM(IF(products=$A10,IF($B$1=\"All Regions\",qtr2_2011,IF(region=$B$1,qtr2_2011))))","v":28699},{"$f":"SUM(IF(products=$A10,IF($B$1=\"All Regions\",qtr3_2011,IF(region=$B$1,qtr3_2011))))","v":28246},{"$f":"SUM(IF(products=$A10,IF($B$1=\"All Regions\",qtr4_2011,IF(region=$B$1,qtr4_2011))))","v":28629},{"$f":"SUM(IF(products=$A10,IF($B$1=\"All Regions\",qtr1_2012,IF(region=$B$1,qtr1_2012))))","v":28946},{"$f":"SUM(IF(products=$A10,IF($B$1=\"All Regions\",qtr2_2012,IF(region=$B$1,qtr2_2012))))","v":27847},{"$f":"SUM(IF(products=$A10,IF($B$1=\"All Regions\",qtr3_2012,IF(region=$B$1,qtr3_2012))))","v":28761},{"$f":"SUM(IF(products=$A10,IF($B$1=\"All Regions\",qtr4_2012,IF(region=$B$1,qtr4_2012))))","v":28018}]
{"$rows_left_out":5}
{"sheet":"Sums","index":4,"n_rows":41,"n_cols":4,"rows_kept":41,"cut":false,"hidden":false,"merged":[]}
["Type","Description","Total Sales","Percent"]
["Product","All-in-one Desktop",{"$f":"SUM(IF(products=B2,totalsales))","v":228169},{"$f":"C2/SUM($C$2:$C$13)","v":8.302540260237401E-2}]
["Product","Economy Laptop",{"$f":"SUM(IF(products=B3,totalsales))","v":227889},{"$f":"C3/SUM($C$2:$C$13)","v":8.2923517102027042E-2}]
["Product","Elite Desktop",{"$f":"SUM(IF(products=B4,totalsales))","v":224001},8.1508764154352167E-2]
["Product","Elite Laptop",{"$f":"SUM(IF(products=B5,totalsales))","v":233702},8.5038732864587255E-2]
["Product","Gamer's Desktop",{"$f":"SUM(IF(products=B6,totalsales))","v":236103},8.591240103006241E-2]
["Product","Hybrid Laptop",{"$f":"SUM(IF(products=B7,totalsales))","v":223875},8.146291567919603E-2]
["Product","Powerhouse Laptop",{"$f":"SUM(IF(products=B8,totalsales))","v":226100},8.2272541530167387E-2]
["Product","Series 5000 Tablet",{"$f":"SUM(IF(products=B9,totalsales))","v":226425},8.2390801485927243E-2]
["Product","Series 8000 Tablet",{"$f":"SUM(IF(products=B10,totalsales))","v":231513},8.4242206577946233E-2]
{"$rows_left_out":32}
{"sheet":"Financial Dashboard","index":5,"n_rows":504,"n_cols":14,"rows_kept":504,"cut":false,"hidden":true,"merged":[]}
["Customer","Industry","Region","Product","Estimated Revenue ($000)","Actual Revenue ($000)","Quarter","Year","Sales Rep","YQ","IYQ","RYQ","SYQ","PYQ"]
["Customer1","Consumer Goods","Europe","Product1",250,255,"Q4",2006,"Fritz Klein","2006Q4","Consumer Goods2006Q4","Europe2006Q4","Fritz Klein2006Q4","Product12006Q4"]
["Customer2","Consumer Goods","North America","Product2",200,319,"Q3",2008,"Porter Le","2008Q3","Consumer Goods2008Q3","North America2008Q3","Porter Le2008Q3","Product22008Q3"]
["Customer3","Services","Asia Pacific","Product1",600,123,"Q3",2006,"Oren Chase","2006Q3","Services2006Q3","Asia Pacific2006Q3","Oren Chase2006Q3","Product12006Q3"]
["Customer4","Finance","North America","Product2",400,272,"Q4",2008,"Porter Le","2008Q4","Finance2008Q4","North America2008Q4","Porter Le2008Q4","Product22008Q4"]
["Customer5","Consumer Goods","Europe","Product3",200,30,"Q2",2006,"Fritz Klein","2006Q2","Consumer Goods2006Q2","Europe2006Q2","Fritz Klein2006Q2","Product32006Q2"]
["Customer6","Services","North America","Product4",550,537,"Q1",2007,"Porter Le","2007Q1","Services2007Q1","North America2007Q1","Porter Le2007Q1","Product42007Q1"]
["Customer7","Technology","North America","Product4",650,89,"Q4",2005,"Porter Le","2005Q4","Technology2005Q4","North America2005Q4","Porter Le2005Q4","Product42005Q4"]
["Customer8","Consumer Goods","Europe","Product2",200,249,"Q4",2003,"Fritz Klein","2003Q4","Consumer Goods2003Q4","Europe2003Q4","Fritz Klein2003Q4","Product22003Q4"]
["Customer9","Healthcare","Asia Pacific","Product2",450,268,"Q4",2005,"Oren Chase","2005Q4","Healthcare2005Q4","Asia Pacific2005Q4","Oren Chase2005Q4","Product22005Q4"]
{"$rows_left_out":495}
{"sheet":"Human Resources","index":6,"n_rows":102,"n_cols":8,"rows_kept":102,"cut":false,"hidden":true,"merged":[[0,2,0,7]]}
[null,null,"Previous Month Data"]
["Full Name","Hire Date","Salary","Bonus","Overtime","Department","Sick Days","Performance Score"]
["Fritz Klein","2014-12-05",20000,3130,220,"Finance",3,4]
["Porter Le","2015-04-28",29000,1800,810,"Administration",4,5]
["Oren Chase","2013-12-26",29000,2550,810,"Human Resources",1,1]
["Nasim Hanson","2015-02-25",30000,4430,840,"Finance",5,5]
["Bradley Valenzuela","2014-04-18",31000,1860,2220,"Marketing",3,3]
["Vaughan Dean","2015-02-28",31000,5550,60,"Marketing",5,4]
["Christopher Guerra","2014-02-20",32000,5250,60,"R&D",1,3]
["Ishmael Grimes","2013-12-20",32000,4690,1460,"Administration",1,2]
{"$rows_left_out":93}
{"sheet":"Stock Performance","index":7,"n_rows":102,"n_cols":7,"rows_kept":102,"cut":false,"hidden":true,"merged":[[0,2,0,6]]}
[null,null,"Close of trading Data"]
["Company Name","Ticker","Prev. Close","Last Trade","Move","%","Volume"]
["Tincidunt Orci Quis Inc.","A1",11.58,11.25,-0.33,-2.8497409326424871E-2,22887335]
["Dapibus Rutrum Justo Associates","A2",48.68,49.27,0.59,1.2119967132292521E-2,6045029]
["Elit Foundation","A3",64.150000000000006,63.56,-0.59,-9.1971940763834747E-3,3431623]
["Ante Institute","A4",6.99,6.9,-0.09,-1.2875536480686695E-2,142828633]
["Eget Mollis Lectus Industries","A5",84.6,83.66,-0.94,-1.1111111111111112E-2,8999757]
["Ligula Limited","A6",16.510000000000002,16.53,0.02,1.2113870381586917E-3,48834995]
["A LLC","A7",98.710000000000008,97.79,-0.92,-9.3202309796373214E-3,8660497]
["At Risus Nunc Inc.","A8",46.38,45.96,-0.42,-9.0556274256144882E-3,6683579]
{"$rows_left_out":93}
{"sheet":"Lkup","index":8,"n_rows":43,"n_cols":3,"rows_kept":43,"cut":false,"hidden":false,"merged":[]}
["ID","Description","Type"]
["Product 1","Touchscreen Laptop","Product"]
["Product 2","Hybrid Laptop","Product"]
["Product 3","Powerhouse Laptop","Product"]
["Product 4","Thin Laptop","Product"]
["Product 5","Economy Laptop","Product"]
["Product 6","Series 8000 Tablet","Product"]
["Product 7","Series 5000 Tablet","Product"]
["Product 8","Hybrid Laptop LED","Product"]
["Product 9","Elite Laptop","Product"]
{"$rows_left_out":33}