{"text_format":"1","workbook":"xlsx","n_sheets":6,"sheets":["US Map","LinkData","Lookup_Tables","Data","Control","Dashboard"],"not_rendered":{"charts":1,"images":2,"macros":1,"external_links":0,"defined_names":51,"comments":0,"pivot_tables":0},"unopened":[],"bounds":{"document_bytes":16777216,"sheet_cells":100000,"rows_first":2000,"rows_last":500,"rows_between":2000,"halvings":0,"cell_chars":16384,"cell_head_chars":4096},"cells_cut":0,"cells_raw":0,"read":"whole","date_system":"1900"}

{"sheet":"US Map","index":0,"n_rows":23,"n_cols":16,"rows_kept":23,"cut":false,"hidden":true,"merged":[]}
[]
[]
[]
[]
[]
[]
[]
[]
[]
[]
[]
[]
[]
[]
[]
[]
[]
[]
[]
[]
{"$rows_left_out":4}
{"sheet":"LinkData","index":1,"n_rows":193,"n_cols":20,"rows_kept":193,"cut":false,"hidden":true,"merged":[]}
["Team","Team Members","Product","Sales Month","State","Region","Login Hours","Total Talk Time","Total Hold Time","Sales","Sales Per Hour","Revenue","Revenue Per Hour","Calls","Excellent Calls","Good Calls","Fair Calls","Poor Calls","Total Calls","CSAT% (Customer Satisfaction)"]
["Team A","Quagmire","Product 1","2014-06-01","California","Far West",7.3,6.3,{"$f":"G2-H2","v":1},18,{"$f":"J2/G2","v":2.4657534246575343},612,{"$f":"L2/G2","v":83.835616438356169},316,28,33,34,11,{"$f":"SUM(N2:R2)","v":422},{"$f":"SUM(O2:P2)/S2","v":0.14454976303317535}]
["Team A","Nola","Product 2","2014-07-01","California","Far West",8.3000000000000007,7.3000000000000007,{"$f":"G3-H3","v":1},21,{"$f":"J3/G3","v":2.5301204819277108},714,{"$f":"L3/G3","v":86.024096385542165},327,25,36,33,12,{"$f":"SUM(N3:R3)","v":433},{"$f":"SUM(O3:P3)/S3","v":0.14087759815242495}]
["Team A","Abel","Product 1","2014-08-01","California","Far West",8.3000000000000007,7.9,0.40000000000000036,15.5,1.8674698795180722,725.4,87.397590361445779,325.10000000000002,26.6,36.4,34.9,10.8,433.8,0.14522821576763484]
["Team A","Angel","Product 2","2014-09-01","California","Far West",7,6.4,0.59999999999999964,22.7,3.2428571428571429,544.9,77.842857142857142,399.9,26.6,34.5,34.6,10.6,506.20000000000005,0.12070327933623073]
["Team A","Quin","Product 2","2014-06-01","Nevada","Far West",8.3000000000000007,7.3000000000000007,1,16,1.9277108433734937,544,65.542168674698786,395,23,35,37,12,502,0.11553784860557768]
["Team A","Aileen","Product 1","2014-07-01","Nevada","Far West",7.6,6.6,1,19,2.5,646,85,324,22,36,39,14,435,0.13333333333333333]
["Team A","Alexis","Product 1","2014-08-01","Nevada","Far West",7.4,6.8000000000000007,0.59999999999999964,16.7,2.2567567567567566,735.5,99.391891891891888,340.1,20.7,38.1,34.700000000000003,11.7,445.3,0.13204581181226138]
["Team A","Aron","Product 2","2014-09-01","Nevada","Far West",21,6.6000000000000005,14.399999999999999,21,1,635.6,30.266666666666669,337.2,27.6,35.9,35.700000000000003,13.3,449.7,0.14120524794307315]
["Team A","Constance","Product 1","2014-06-01","Oregon","Far West",8,7,1,16,2,544,68,310,29,32,30,11,412,0.14805825242718446]
["Team A","Melodie","Product 1","2014-07-01","Oregon","Far West",7,6,1,23,3.2857142857142856,782,111.71428571428571,456,27,38,40,13,574,0.1132404181184669]
["Team A","Alonzo","Product 1","2014-08-01","Oregon","Far West",7.9,7.5,0.40000000000000036,21.4,2.7088607594936707,676,85.569620253164558,392,26.4,30.2,30.8,12,491.4,0.11518111518111518]
["Team A","Augustine","Product 2","2014-09-01","Oregon","Far West",7.4,6.9,0.5,23.4,3.1621621621621618,687,92.837837837837839,341.1,22.3,38.6,30.8,11.2,444.00000000000006,0.13716216216216215]
["Team A","Rhoda","Product 1","2014-06-01","Washington","Far West",8,7,1,21,2.625,714,89.25,339,25,32,31,14,441,0.12925170068027211]
["Team A","Zia","Product 2","2014-07-01","Washington","Far West",7.5,6.5,1,25,3.3333333333333335,850,113.33333333333333,353,22,31,37,13,456,0.1162280701754386]
["Team A","Anderson","Product 1","2014-08-01","Washington","Far West",8.1,7.6999999999999993,0.40000000000000036,20.3,2.5061728395061729,600,74.074074074074076,352.4,29.1,36.5,36.1,12.3,466.40000000000003,0.1406518010291595]
["Team A","Basil","Product 2","2014-09-01","Washington","Far West",8.3000000000000007,7.5000000000000009,0.79999999999999982,17.3,2.0843373493975901,705.6,85.012048192771076,385.8,24.2,33.4,40,10,493.4,0.11674098094852046]
["Team B","Katelyn","Product 1","2014-06-01","Illinois","Great Lakes",7,6,1,21,3,714,102,322,24,30,32,14,422,0.12796208530805686]
["Team B","Amanda","Product 2","2014-07-01","Illinois","Great Lakes",7.6,6.6,1,17,2.236842105263158,578,76.05263157894737,347,20,40,35,15,457,0.13129102844638948]
["Team B","Adolph","Product 1","2014-08-01","Illinois","Great Lakes",8.1,7.6,0.5,18.100000000000001,2.2345679012345681,687.8,84.913580246913583,365.1,22.3,34.9,34.200000000000003,12.2,468.7,0.12203968423298486]
{"$rows_left_out":174}
{"sheet":"Lookup_Tables","index":2,"n_rows":12,"n_cols":21,"rows_kept":12,"cut":false,"hidden":true,"merged":[]}
["Date",3,null,null,"Metric",5,null,null,"Geo",2,null,null,"Chart Type",1,null,null,"Login Hours","Talk Time","Hold Time"]
["Result",{"$f":"VLOOKUP(B1,A3:B6,2,0)","v":"2014-08-01"},{"$f":"VLOOKUP(B1,A3:C6,3,0)","v":"August 2014"},null,"Result",{"$f":"VLOOKUP(F1,E3:F12,2,0)","v":"Revenue"},null,null,"Result",{"$f":"VLOOKUP(J1,I3:J4,2,0)","v":"By Team"},null,null,"Result",{"$f":"VLOOKUP(N1,M3:N5,2,0)","v":"Hours"},null,null,"Sales","Sales/Hour","Revenue","Revenue/Hour"]
[1,"2014-06-01","June 2014",null,1,"Login Hours",null,null,1,"By State",null,null,1,"Hours",null,"OOO","Total Calls","% Excellent","% Good","% Fair","% Poor"]
[2,"2014-07-01","July 2014",null,2,"Total Talk Time",null,null,2,"By Team",null,null,2,"Sales"]
[3,"2014-08-01","August 2014",null,3,"Total Hold Time",null,null,null,null,null,null,3,"Calls"]
[4,"2014-09-01","Sept. 2014",null,4,"Sales"]
[null,null,null,null,5,"Revenue"]
[null,null,null,null,6,"Total Calls"]
[null,null,null,null,7,"Excellent Calls"]
[null,null,null,null,8,"Good Calls"]
[null,null,null,null,9,"Fair Calls"]
[null,null,null,null,10,"Poor Calls"]

{"sheet":"Data","index":3,"n_rows":52,"n_cols":5,"rows_kept":52,"cut":false,"hidden":true,"merged":[]}
[]
[null,"Data"]
[]
["Region","No.","State","Abbreviation","Metric"]
["Southeast",1,"Alabama","AL",{"$f":"IF(Lookup_Tables!$J$1=1,SUMIFS(OFFSET(LinkData!A:A,0,MATCH(Lookup_Tables!$F$2,LinkData!$A$1:$Y$1,0)-1),LinkData!E:E,Data!C5,LinkData!D:D,Lookup_Tables!$B$2),SUMIFS(OFFSET(LinkData!A:A,0,MATCH(Lookup_Tables!$F$2,LinkData!$A$1:$Y$1,0)-1),LinkData!F:F,Data!A5,LinkData!D:D,Lookup_Tables!$B$2))","v":5098.2662499999988}]
["Southeast",{"$f":"B5+1","v":2},"Arkansas","AR",{"$f":"IF(Lookup_Tables!$J$1=1,SUMIFS(OFFSET(LinkData!A:A,0,MATCH(Lookup_Tables!$F$2,LinkData!$A$1:$Y$1,0)-1),LinkData!E:E,Data!C6,LinkData!D:D,Lookup_Tables!$B$2),SUMIFS(OFFSET(LinkData!A:A,0,MATCH(Lookup_Tables!$F$2,LinkData!$A$1:$Y$1,0)-1),LinkData!F:F,Data!A6,LinkData!D:D,Lookup_Tables!$B$2))","v":5098.2662499999988}]
["Southwest",3,"Arizona","AZ",{"$f":"IF(Lookup_Tables!$J$1=1,SUMIFS(OFFSET(LinkData!A:A,0,MATCH(Lookup_Tables!$F$2,LinkData!$A$1:$Y$1,0)-1),LinkData!E:E,Data!C7,LinkData!D:D,Lookup_Tables!$B$2),SUMIFS(OFFSET(LinkData!A:A,0,MATCH(Lookup_Tables!$F$2,LinkData!$A$1:$Y$1,0)-1),LinkData!F:F,Data!A7,LinkData!D:D,Lookup_Tables!$B$2))","v":2801.2000000000003}]
["Far West",4,"California","CA",{"$f":"IF(Lookup_Tables!$J$1=1,SUMIFS(OFFSET(LinkData!A:A,0,MATCH(Lookup_Tables!$F$2,LinkData!$A$1:$Y$1,0)-1),LinkData!E:E,Data!C8,LinkData!D:D,Lookup_Tables!$B$2),SUMIFS(OFFSET(LinkData!A:A,0,MATCH(Lookup_Tables!$F$2,LinkData!$A$1:$Y$1,0)-1),LinkData!F:F,Data!A8,LinkData!D:D,Lookup_Tables!$B$2))","v":2736.9}]
["Rocky Mountain",5,"Colorado","CO",{"$f":"IF(Lookup_Tables!$J$1=1,SUMIFS(OFFSET(LinkData!A:A,0,MATCH(Lookup_Tables!$F$2,LinkData!$A$1:$Y$1,0)-1),LinkData!E:E,Data!C9,LinkData!D:D,Lookup_Tables!$B$2),SUMIFS(OFFSET(LinkData!A:A,0,MATCH(Lookup_Tables!$F$2,LinkData!$A$1:$Y$1,0)-1),LinkData!F:F,Data!A9,LinkData!D:D,Lookup_Tables!$B$2))","v":3580}]
["New England",6,"Connecticut","CT",{"$f":"IF(Lookup_Tables!$J$1=1,SUMIFS(OFFSET(LinkData!A:A,0,MATCH(Lookup_Tables!$F$2,LinkData!$A$1:$Y$1,0)-1),LinkData!E:E,Data!C10,LinkData!D:D,Lookup_Tables!$B$2),SUMIFS(OFFSET(LinkData!A:A,0,MATCH(Lookup_Tables!$F$2,LinkData!$A$1:$Y$1,0)-1),LinkData!F:F,Data!A10,LinkData!D:D,Lookup_Tables!$B$2))","v":4000.6}]
["Mideast",7,"Delaware","DE",{"$f":"IF(Lookup_Tables!$J$1=1,SUMIFS(OFFSET(LinkData!A:A,0,MATCH(Lookup_Tables!$F$2,LinkData!$A$1:$Y$1,0)-1),LinkData!E:E,Data!C11,LinkData!D:D,Lookup_Tables!$B$2),SUMIFS(OFFSET(LinkData!A:A,0,MATCH(Lookup_Tables!$F$2,LinkData!$A$1:$Y$1,0)-1),LinkData!F:F,Data!A11,LinkData!D:D,Lookup_Tables!$B$2))","v":3685.3999999999996}]
["Southeast",8,"Florida","FL",{"$f":"IF(Lookup_Tables!$J$1=1,SUMIFS(OFFSET(LinkData!A:A,0,MATCH(Lookup_Tables!$F$2,LinkData!$A$1:$Y$1,0)-1),LinkData!E:E,Data!C12,LinkData!D:D,Lookup_Tables!$B$2),SUMIFS(OFFSET(LinkData!A:A,0,MATCH(Lookup_Tables!$F$2,LinkData!$A$1:$Y$1,0)-1),LinkData!F:F,Data!A12,LinkData!D:D,Lookup_Tables!$B$2))","v":5098.2662499999988}]
["Southeast",9,"Georgia","GA",{"$f":"IF(Lookup_Tables!$J$1=1,SUMIFS(OFFSET(LinkData!A:A,0,MATCH(Lookup_Tables!$F$2,LinkData!$A$1:$Y$1,0)-1),LinkData!E:E,Data!C13,LinkData!D:D,Lookup_Tables!$B$2),SUMIFS(OFFSET(LinkData!A:A,0,MATCH(Lookup_Tables!$F$2,LinkData!$A$1:$Y$1,0)-1),LinkData!F:F,Data!A13,LinkData!D:D,Lookup_Tables!$B$2))","v":5098.2662499999988}]
["Plains",10,"Iowa","IA",{"$f":"IF(Lookup_Tables!$J$1=1,SUMIFS(OFFSET(LinkData!A:A,0,MATCH(Lookup_Tables!$F$2,LinkData!$A$1:$Y$1,0)-1),LinkData!E:E,Data!C14,LinkData!D:D,Lookup_Tables!$B$2),SUMIFS(OFFSET(LinkData!A:A,0,MATCH(Lookup_Tables!$F$2,LinkData!$A$1:$Y$1,0)-1),LinkData!F:F,Data!A14,LinkData!D:D,Lookup_Tables!$B$2))","v":4416.2999999999993}]
["Rocky Mountain",11,"Idaho","ID",{"$f":"IF(Lookup_Tables!$J$1=1,SUMIFS(OFFSET(LinkData!A:A,0,MATCH(Lookup_Tables!$F$2,LinkData!$A$1:$Y$1,0)-1),LinkData!E:E,Data!C15,LinkData!D:D,Lookup_Tables!$B$2),SUMIFS(OFFSET(LinkData!A:A,0,MATCH(Lookup_Tables!$F$2,LinkData!$A$1:$Y$1,0)-1),LinkData!F:F,Data!A15,LinkData!D:D,Lookup_Tables!$B$2))","v":3580}]
["Great Lakes",12,"Illinois","IL",{"$f":"IF(Lookup_Tables!$J$1=1,SUMIFS(OFFSET(LinkData!A:A,0,MATCH(Lookup_Tables!$F$2,LinkData!$A$1:$Y$1,0)-1),LinkData!E:E,Data!C16,LinkData!D:D,Lookup_Tables!$B$2),SUMIFS(OFFSET(LinkData!A:A,0,MATCH(Lookup_Tables!$F$2,LinkData!$A$1:$Y$1,0)-1),LinkData!F:F,Data!A16,LinkData!D:D,Lookup_Tables!$B$2))","v":3377.5}]
["Great Lakes",13,"Indiana","IN",{"$f":"IF(Lookup_Tables!$J$1=1,SUMIFS(OFFSET(LinkData!A:A,0,MATCH(Lookup_Tables!$F$2,LinkData!$A$1:$Y$1,0)-1),LinkData!E:E,Data!C17,LinkData!D:D,Lookup_Tables!$B$2),SUMIFS(OFFSET(LinkData!A:A,0,MATCH(Lookup_Tables!$F$2,LinkData!$A$1:$Y$1,0)-1),LinkData!F:F,Data!A17,LinkData!D:D,Lookup_Tables!$B$2))","v":3377.5}]
["Plains",14,"Kansas","KS",{"$f":"IF(Lookup_Tables!$J$1=1,SUMIFS(OFFSET(LinkData!A:A,0,MATCH(Lookup_Tables!$F$2,LinkData!$A$1:$Y$1,0)-1),LinkData!E:E,Data!C18,LinkData!D:D,Lookup_Tables!$B$2),SUMIFS(OFFSET(LinkData!A:A,0,MATCH(Lookup_Tables!$F$2,LinkData!$A$1:$Y$1,0)-1),LinkData!F:F,Data!A18,LinkData!D:D,Lookup_Tables!$B$2))","v":4416.2999999999993}]
["Southeast",15,"Kentucky","KY",{"$f":"IF(Lookup_Tables!$J$1=1,SUMIFS(OFFSET(LinkData!A:A,0,MATCH(Lookup_Tables!$F$2,LinkData!$A$1:$Y$1,0)-1),LinkData!E:E,Data!C19,LinkData!D:D,Lookup_Tables!$B$2),SUMIFS(OFFSET(LinkData!A:A,0,MATCH(Lookup_Tables!$F$2,LinkData!$A$1:$Y$1,0)-1),LinkData!F:F,Data!A19,LinkData!D:D,Lookup_Tables!$B$2))","v":5098.2662499999988}]
["Southeast",16,"Louisiana","LA",{"$f":"IF(Lookup_Tables!$J$1=1,SUMIFS(OFFSET(LinkData!A:A,0,MATCH(Lookup_Tables!$F$2,LinkData!$A$1:$Y$1,0)-1),LinkData!E:E,Data!C20,LinkData!D:D,Lookup_Tables!$B$2),SUMIFS(OFFSET(LinkData!A:A,0,MATCH(Lookup_Tables!$F$2,LinkData!$A$1:$Y$1,0)-1),LinkData!F:F,Data!A20,LinkData!D:D,Lookup_Tables!$B$2))","v":5098.2662499999988}]
{"$rows_left_out":33}
{"sheet":"Control","index":4,"n_rows":114,"n_cols":17,"rows_kept":114,"cut":false,"hidden":true,"merged":[]}
[]
[null,null,"Control: Don't Touch"]
[]
[]
[]
[]
[]
[]
[]
[]
[]
[null,null,"Darkness",5,"the smaller the darker (max: 5,21)"]
[]
[null,null,"Steps","Threshold","RGB","Min / Max"]
[null,null,{"$f":"C16+$D$12","v":245},{"$f":"F16","v":2736.9},{"$f":"udf_RGB(255,165+C15/3.27,C15)","v":16118015},{"$f":"MAX(Data!$E$5:$E$52)","v":5098.2662499999988}]
[null,null,240,{"$f":"D15+$F$17","v":2786.0951302083336},15789823,{"$f":"MIN(Data!$E$5:$E$52)","v":2736.9}]
[null,null,235,2835.290260416667,15461887,{"$f":"(F15-F16)/(COUNT($C$15:$C$64)-2)","v":49.195130208333303}]
[null,null,230,2884.4853906250005,15133695]
[null,null,225,2933.680520833334,14805759]
[null,null,220,2982.8756510416674,14477567]
{"$rows_left_out":95}
{"sheet":"Dashboard","index":5,"n_rows":14,"n_cols":23,"rows_kept":14,"cut":false,"hidden":false,"merged":[]}
[]
[]
[]
[]
[null,null,null,null,null,null,null,null,null,null,null,null,null,null,null,null,null,null,null,null,null,null,{"$f":"Lookup_Tables!C2","v":"August 2014"}]
[null,null,null,null,null,null,null,null,null,null,null,null,"Team",{"$f":"IF(IF(Lookup_Tables!$N$1=1,Lookup_Tables!Q1,IF(Lookup_Tables!$N$1=2,Lookup_Tables!Q2,IF(Lookup_Tables!$N$1=3,Lookup_Tables!Q3,\"\")))=0,\"\",IF(Lookup_Tables!$N$1=1,Lookup_Tables!Q1,IF(Lookup_Tables!$N$1=2,Lookup_Tables!Q2,IF(Lookup_Tables!$N$1=3,Lookup_Tables!Q3,\"\"))))","v":"Login Hours"},{"$f":"IF(IF(Lookup_Tables!$N$1=1,Lookup_Tables!R1,IF(Lookup_Tables!$N$1=2,Lookup_Tables!R2,IF(Lookup_Tables!$N$1=3,Lookup_Tables!R3,\"\")))=0,\"\",IF(Lookup_Tables!$N$1=1,Lookup_Tables!R1,IF(Lookup_Tables!$N$1=2,Lookup_Tables!R2,IF(Lookup_Tables!$N$1=3,Lookup_Tables!R3,\"\"))))","v":"Talk Time"},{"$f":"IF(IF(Lookup_Tables!$N$1=1,Lookup_Tables!S1,IF(Lookup_Tables!$N$1=2,Lookup_Tables!S2,IF(Lookup_Tables!$N$1=3,Lookup_Tables!S3,\"\")))=0,\"\",IF(Lookup_Tables!$N$1=1,Lookup_Tables!S1,IF(Lookup_Tables!$N$1=2,Lookup_Tables!S2,IF(Lookup_Tables!$N$1=3,Lookup_Tables!S3,\"\"))))","v":"Hold Time"},{"$f":"IF(IF(Lookup_Tables!$N$1=1,Lookup_Tables!T1,IF(Lookup_Tables!$N$1=2,Lookup_Tables!T2,IF(Lookup_Tables!$N$1=3,Lookup_Tables!T3,\"\")))=0,\"\",IF(Lookup_Tables!$N$1=1,Lookup_Tables!T1,IF(Lookup_Tables!$N$1=2,Lookup_Tables!T2,IF(Lookup_Tables!$N$1=3,Lookup_Tables!T3,\"\"))))","v":""},{"$f":"IF(IF(Lookup_Tables!$N$1=1,Lookup_Tables!U1,IF(Lookup_Tables!$N$1=2,Lookup_Tables!U2,IF(Lookup_Tables!$N$1=3,Lookup_Tables!U3,\"\")))=0,\"\",IF(Lookup_Tables!$N$1=1,Lookup_Tables!U1,IF(Lookup_Tables!$N$1=2,Lookup_Tables!U2,IF(Lookup_Tables!$N$1=3,Lookup_Tables!U3,\"\"))))","v":""}]
[null,null,null,null,null,null,null,null,null,null,null,null,"Team A: Far West",{"$f":"TEXT(IF(Lookup_Tables!$N$1=1,SUMIF(LinkData!$A:$A,LEFT($M7,6),LinkData!G:G),IF(Lookup_Tables!$N$1=2,SUMIF(LinkData!$A:$A,LEFT($M7,6),LinkData!J:J),IF(Lookup_Tables!$N$1=3,SUMIF(LinkData!$A:$A,LEFT($M7,6),LinkData!S:S)))),\"#,##0\")","v":"137"},{"$f":"IF(Lookup_Tables!$N$1=1,TEXT(SUMIF(LinkData!$A:$A,LEFT($M7,6),LinkData!H:H),\"#,##0\"),IF(Lookup_Tables!$N$1=2,N7/SUMIF(LinkData!$A:$A,LEFT($M7,6),LinkData!G:G),IF(Lookup_Tables!$N$1=3,TEXT(SUMIF(LinkData!$A:$A,LEFT($M7,6),LinkData!O:O)/N7,\"0.00%\"))))","v":"111"},{"$f":"IF(Lookup_Tables!$N$1=1,TEXT(SUMIF(LinkData!$A:$A,LEFT($M7,6),LinkData!I:I),\"#,##0\"),IF(Lookup_Tables!$N$1=2,TEXT(SUMIF(LinkData!$A:$A,LEFT($M7,6),LinkData!L:L),\"$#,##0\"),IF(Lookup_Tables!$N$1=3,TEXT(SUMIF(LinkData!$A:$A,LEFT($M7,6),LinkData!P:P)/N7,\"0.00%\"))))","v":"26"},{"$f":"IF(Lookup_Tables!$N$1=1,\"\",IF(Lookup_Tables!$N$1=2,TEXT(P7/SUMIF(LinkData!$A:$A,LEFT($M7,6),LinkData!G:G),\"$#,##0.00\"),IF(Lookup_Tables!$N$1=3,TEXT(SUMIF(LinkData!$A:$A,LEFT($M7,6),LinkData!Q:Q)/N7,\"0.00%\"))))","v":""},{"$f":"IF(Lookup_Tables!$N$1=1,\"\",IF(Lookup_Tables!$N$1=2,\"\",IF(Lookup_Tables!$N$1=3,TEXT(SUMIF(LinkData!$A:$A,LEFT($M7,6),LinkData!R:R)/N7,\"0.00%\"))))","v":""},null,null,null,null,{"$f":"N14/1","v":123}]
[null,null,null,null,null,null,null,null,null,null,null,null,"Team B: Great Lakes",{"$f":"TEXT(IF(Lookup_Tables!$N$1=1,SUMIF(LinkData!$A:$A,LEFT($M8,6),LinkData!G:G),IF(Lookup_Tables!$N$1=2,SUMIF(LinkData!$A:$A,LEFT($M8,6),LinkData!J:J),IF(Lookup_Tables!$N$1=3,SUMIF(LinkData!$A:$A,LEFT($M8,6),LinkData!S:S)))),\"#,##0\")","v":"152"},{"$f":"IF(Lookup_Tables!$N$1=1,TEXT(SUMIF(LinkData!$A:$A,LEFT($M8,6),LinkData!H:H),\"#,##0\"),IF(Lookup_Tables!$N$1=2,N8/SUMIF(LinkData!$A:$A,LEFT($M8,6),LinkData!G:G),IF(Lookup_Tables!$N$1=3,TEXT(SUMIF(LinkData!$A:$A,LEFT($M8,6),LinkData!O:O)/N8,\"0.00%\"))))","v":"137"},{"$f":"IF(Lookup_Tables!$N$1=1,TEXT(SUMIF(LinkData!$A:$A,LEFT($M8,6),LinkData!I:I),\"#,##0\"),IF(Lookup_Tables!$N$1=2,TEXT(SUMIF(LinkData!$A:$A,LEFT($M8,6),LinkData!L:L),\"$#,##0\"),IF(Lookup_Tables!$N$1=3,TEXT(SUMIF(LinkData!$A:$A,LEFT($M8,6),LinkData!P:P)/N8,\"0.00%\"))))","v":"15"},{"$f":"IF(Lookup_Tables!$N$1=1,\"\",IF(Lookup_Tables!$N$1=2,TEXT(P8/SUMIF(LinkData!$A:$A,LEFT($M8,6),LinkData!G:G),\"$#,##0.00\"),IF(Lookup_Tables!$N$1=3,TEXT(SUMIF(LinkData!$A:$A,LEFT($M8,6),LinkData!Q:Q)/N8,\"0.00%\"))))","v":""},{"$f":"IF(Lookup_Tables!$N$1=1,\"\",IF(Lookup_Tables!$N$1=2,\"\",IF(Lookup_Tables!$N$1=3,TEXT(SUMIF(LinkData!$A:$A,LEFT($M8,6),LinkData!R:R)/N8,\"0.00%\"))))","v":""},null,null,null,null,{"$f":"N13/1","v":250}]
[null,null,null,null,null,null,null,null,null,null,null,null,"Team C: Mideast",{"$f":"TEXT(IF(Lookup_Tables!$N$1=1,SUMIF(LinkData!$A:$A,LEFT($M9,6),LinkData!G:G),IF(Lookup_Tables!$N$1=2,SUMIF(LinkData!$A:$A,LEFT($M9,6),LinkData!J:J),IF(Lookup_Tables!$N$1=3,SUMIF(LinkData!$A:$A,LEFT($M9,6),LinkData!S:S)))),\"#,##0\")","v":"152"},{"$f":"IF(Lookup_Tables!$N$1=1,TEXT(SUMIF(LinkData!$A:$A,LEFT($M9,6),LinkData!H:H),\"#,##0\"),IF(Lookup_Tables!$N$1=2,N9/SUMIF(LinkData!$A:$A,LEFT($M9,6),LinkData!G:G),IF(Lookup_Tables!$N$1=3,TEXT(SUMIF(LinkData!$A:$A,LEFT($M9,6),LinkData!O:O)/N9,\"0.00%\"))))","v":"138"},{"$f":"IF(Lookup_Tables!$N$1=1,TEXT(SUMIF(LinkData!$A:$A,LEFT($M9,6),LinkData!I:I),\"#,##0\"),IF(Lookup_Tables!$N$1=2,TEXT(SUMIF(LinkData!$A:$A,LEFT($M9,6),LinkData!L:L),\"$#,##0\"),IF(Lookup_Tables!$N$1=3,TEXT(SUMIF(LinkData!$A:$A,LEFT($M9,6),LinkData!P:P)/N9,\"0.00%\"))))","v":"15"},{"$f":"IF(Lookup_Tables!$N$1=1,\"\",IF(Lookup_Tables!$N$1=2,TEXT(P9/SUMIF(LinkData!$A:$A,LEFT($M9,6),LinkData!G:G),\"$#,##0.00\"),IF(Lookup_Tables!$N$1=3,TEXT(SUMIF(LinkData!$A:$A,LEFT($M9,6),LinkData!Q:Q)/N9,\"0.00%\"))))","v":""},{"$f":"IF(Lookup_Tables!$N$1=1,\"\",IF(Lookup_Tables!$N$1=2,\"\",IF(Lookup_Tables!$N$1=3,TEXT(SUMIF(LinkData!$A:$A,LEFT($M9,6),LinkData!R:R)/N9,\"0.00%\"))))","v":""},null,null,null,null,{"$f":"N12/1","v":154}]
[null,null,null,null,null,null,null,null,null,null,null,null,"Team D: New England",{"$f":"TEXT(IF(Lookup_Tables!$N$1=1,SUMIF(LinkData!$A:$A,LEFT($M10,6),LinkData!G:G),IF(Lookup_Tables!$N$1=2,SUMIF(LinkData!$A:$A,LEFT($M10,6),LinkData!J:J),IF(Lookup_Tables!$N$1=3,SUMIF(LinkData!$A:$A,LEFT($M10,6),LinkData!S:S)))),\"#,##0\")","v":"180"},{"$f":"IF(Lookup_Tables!$N$1=1,TEXT(SUMIF(LinkData!$A:$A,LEFT($M10,6),LinkData!H:H),\"#,##0\"),IF(Lookup_Tables!$N$1=2,N10/SUMIF(LinkData!$A:$A,LEFT($M10,6),LinkData!G:G),IF(Lookup_Tables!$N$1=3,TEXT(SUMIF(LinkData!$A:$A,LEFT($M10,6),LinkData!O:O)/N10,\"0.00%\"))))","v":"163"},{"$f":"IF(Lookup_Tables!$N$1=1,TEXT(SUMIF(LinkData!$A:$A,LEFT($M10,6),LinkData!I:I),\"#,##0\"),IF(Lookup_Tables!$N$1=2,TEXT(SUMIF(LinkData!$A:$A,LEFT($M10,6),LinkData!L:L),\"$#,##0\"),IF(Lookup_Tables!$N$1=3,TEXT(SUMIF(LinkData!$A:$A,LEFT($M10,6),LinkData!P:P)/N10,\"0.00%\"))))","v":"18"},{"$f":"IF(Lookup_Tables!$N$1=1,\"\",IF(Lookup_Tables!$N$1=2,TEXT(P10/SUMIF(LinkData!$A:$A,LEFT($M10,6),LinkData!G:G),\"$#,##0.00\"),IF(Lookup_Tables!$N$1=3,TEXT(SUMIF(LinkData!$A:$A,LEFT($M10,6),LinkData!Q:Q)/N10,\"0.00%\"))))","v":""},{"$f":"IF(Lookup_Tables!$N$1=1,\"\",IF(Lookup_Tables!$N$1=2,\"\",IF(Lookup_Tables!$N$1=3,TEXT(SUMIF(LinkData!$A:$A,LEFT($M10,6),LinkData!R:R)/N10,\"0.00%\"))))","v":""},null,null,null,null,{"$f":"N11/1","v":214}]
[null,null,null,null,null,null,null,null,null,null,null,null,"Team E: Plains",{"$f":"TEXT(IF(Lookup_Tables!$N$1=1,SUMIF(LinkData!$A:$A,LEFT($M11,6),LinkData!G:G),IF(Lookup_Tables!$N$1=2,SUMIF(LinkData!$A:$A,LEFT($M11,6),LinkData!J:J),IF(Lookup_Tables!$N$1=3,SUMIF(LinkData!$A:$A,LEFT($M11,6),LinkData!S:S)))),\"#,##0\")","v":"214"},{"$f":"IF(Lookup_Tables!$N$1=1,TEXT(SUMIF(LinkData!$A:$A,LEFT($M11,6),LinkData!H:H),\"#,##0\"),IF(Lookup_Tables!$N$1=2,N11/SUMIF(LinkData!$A:$A,LEFT($M11,6),LinkData!G:G),IF(Lookup_Tables!$N$1=3,TEXT(SUMIF(LinkData!$A:$A,LEFT($M11,6),LinkData!O:O)/N11,\"0.00%\"))))","v":"194"},{"$f":"IF(Lookup_Tables!$N$1=1,TEXT(SUMIF(LinkData!$A:$A,LEFT($M11,6),LinkData!I:I),\"#,##0\"),IF(Lookup_Tables!$N$1=2,TEXT(SUMIF(LinkData!$A:$A,LEFT($M11,6),LinkData!L:L),\"$#,##0\"),IF(Lookup_Tables!$N$1=3,TEXT(SUMIF(LinkData!$A:$A,LEFT($M11,6),LinkData!P:P)/N11,\"0.00%\"))))","v":"21"},{"$f":"IF(Lookup_Tables!$N$1=1,\"\",IF(Lookup_Tables!$N$1=2,TEXT(P11/SUMIF(LinkData!$A:$A,LEFT($M11,6),LinkData!G:G),\"$#,##0.00\"),IF(Lookup_Tables!$N$1=3,TEXT(SUMIF(LinkData!$A:$A,LEFT($M11,6),LinkData!Q:Q)/N11,\"0.00%\"))))","v":""},{"$f":"IF(Lookup_Tables!$N$1=1,\"\",IF(Lookup_Tables!$N$1=2,\"\",IF(Lookup_Tables!$N$1=3,TEXT(SUMIF(LinkData!$A:$A,LEFT($M11,6),LinkData!R:R)/N11,\"0.00%\"))))","v":""},null,null,null,null,{"$f":"N10/1","v":180}]
[null,null,null,null,null,null,null,null,null,null,null,null,"Team F: Rocky Mountain",{"$f":"TEXT(IF(Lookup_Tables!$N$1=1,SUMIF(LinkData!$A:$A,LEFT($M12,6),LinkData!G:G),IF(Lookup_Tables!$N$1=2,SUMIF(LinkData!$A:$A,LEFT($M12,6),LinkData!J:J),IF(Lookup_Tables!$N$1=3,SUMIF(LinkData!$A:$A,LEFT($M12,6),LinkData!S:S)))),\"#,##0\")","v":"154"},{"$f":"IF(Lookup_Tables!$N$1=1,TEXT(SUMIF(LinkData!$A:$A,LEFT($M12,6),LinkData!H:H),\"#,##0\"),IF(Lookup_Tables!$N$1=2,N12/SUMIF(LinkData!$A:$A,LEFT($M12,6),LinkData!G:G),IF(Lookup_Tables!$N$1=3,TEXT(SUMIF(LinkData!$A:$A,LEFT($M12,6),LinkData!O:O)/N12,\"0.00%\"))))","v":"139"},{"$f":"IF(Lookup_Tables!$N$1=1,TEXT(SUMIF(LinkData!$A:$A,LEFT($M12,6),LinkData!I:I),\"#,##0\"),IF(Lookup_Tables!$N$1=2,TEXT(SUMIF(LinkData!$A:$A,LEFT($M12,6),LinkData!L:L),\"$#,##0\"),IF(Lookup_Tables!$N$1=3,TEXT(SUMIF(LinkData!$A:$A,LEFT($M12,6),LinkData!P:P)/N12,\"0.00%\"))))","v":"15"},{"$f":"IF(Lookup_Tables!$N$1=1,\"\",IF(Lookup_Tables!$N$1=2,TEXT(P12/SUMIF(LinkData!$A:$A,LEFT($M12,6),LinkData!G:G),\"$#,##0.00\"),IF(Lookup_Tables!$N$1=3,TEXT(SUMIF(LinkData!$A:$A,LEFT($M12,6),LinkData!Q:Q)/N12,\"0.00%\"))))","v":""},{"$f":"IF(Lookup_Tables!$N$1=1,\"\",IF(Lookup_Tables!$N$1=2,\"\",IF(Lookup_Tables!$N$1=3,TEXT(SUMIF(LinkData!$A:$A,LEFT($M12,6),LinkData!R:R)/N12,\"0.00%\"))))","v":""},null,null,null,null,{"$f":"N9/1","v":152}]
[null,null,null,null,null,null,null,null,null,null,null,null,"Team G: Southeast",{"$f":"TEXT(IF(Lookup_Tables!$N$1=1,SUMIF(LinkData!$A:$A,LEFT($M13,6),LinkData!G:G),IF(Lookup_Tables!$N$1=2,SUMIF(LinkData!$A:$A,LEFT($M13,6),LinkData!J:J),IF(Lookup_Tables!$N$1=3,SUMIF(LinkData!$A:$A,LEFT($M13,6),LinkData!S:S)))),\"#,##0\")","v":"250"},{"$f":"IF(Lookup_Tables!$N$1=1,TEXT(SUMIF(LinkData!$A:$A,LEFT($M13,6),LinkData!H:H),\"#,##0\"),IF(Lookup_Tables!$N$1=2,N13/SUMIF(LinkData!$A:$A,LEFT($M13,6),LinkData!G:G),IF(Lookup_Tables!$N$1=3,TEXT(SUMIF(LinkData!$A:$A,LEFT($M13,6),LinkData!O:O)/N13,\"0.00%\"))))","v":"225"},{"$f":"IF(Lookup_Tables!$N$1=1,TEXT(SUMIF(LinkData!$A:$A,LEFT($M13,6),LinkData!I:I),\"#,##0\"),IF(Lookup_Tables!$N$1=2,TEXT(SUMIF(LinkData!$A:$A,LEFT($M13,6),LinkData!L:L),\"$#,##0\"),IF(Lookup_Tables!$N$1=3,TEXT(SUMIF(LinkData!$A:$A,LEFT($M13,6),LinkData!P:P)/N13,\"0.00%\"))))","v":"25"},{"$f":"IF(Lookup_Tables!$N$1=1,\"\",IF(Lookup_Tables!$N$1=2,TEXT(P13/SUMIF(LinkData!$A:$A,LEFT($M13,6),LinkData!G:G),\"$#,##0.00\"),IF(Lookup_Tables!$N$1=3,TEXT(SUMIF(LinkData!$A:$A,LEFT($M13,6),LinkData!Q:Q)/N13,\"0.00%\"))))","v":""},{"$f":"IF(Lookup_Tables!$N$1=1,\"\",IF(Lookup_Tables!$N$1=2,\"\",IF(Lookup_Tables!$N$1=3,TEXT(SUMIF(LinkData!$A:$A,LEFT($M13,6),LinkData!R:R)/N13,\"0.00%\"))))","v":""},null,null,null,null,{"$f":"N8/1","v":152}]
[null,null,null,null,null,null,null,null,null,null,null,null,"Team H: Southwest",{"$f":"TEXT(IF(Lookup_Tables!$N$1=1,SUMIF(LinkData!$A:$A,LEFT($M14,6),LinkData!G:G),IF(Lookup_Tables!$N$1=2,SUMIF(LinkData!$A:$A,LEFT($M14,6),LinkData!J:J),IF(Lookup_Tables!$N$1=3,SUMIF(LinkData!$A:$A,LEFT($M14,6),LinkData!S:S)))),\"#,##0\")","v":"123"},{"$f":"IF(Lookup_Tables!$N$1=1,TEXT(SUMIF(LinkData!$A:$A,LEFT($M14,6),LinkData!H:H),\"#,##0\"),IF(Lookup_Tables!$N$1=2,N14/SUMIF(LinkData!$A:$A,LEFT($M14,6),LinkData!G:G),IF(Lookup_Tables!$N$1=3,TEXT(SUMIF(LinkData!$A:$A,LEFT($M14,6),LinkData!O:O)/N14,\"0.00%\"))))","v":"111"},{"$f":"IF(Lookup_Tables!$N$1=1,TEXT(SUMIF(LinkData!$A:$A,LEFT($M14,6),LinkData!I:I),\"#,##0\"),IF(Lookup_Tables!$N$1=2,TEXT(SUMIF(LinkData!$A:$A,LEFT($M14,6),LinkData!L:L),\"$#,##0\"),IF(Lookup_Tables!$N$1=3,TEXT(SUMIF(LinkData!$A:$A,LEFT($M14,6),LinkData!P:P)/N14,\"0.00%\"))))","v":"12"},{"$f":"IF(Lookup_Tables!$N$1=1,\"\",IF(Lookup_Tables!$N$1=2,TEXT(P14/SUMIF(LinkData!$A:$A,LEFT($M14,6),LinkData!G:G),\"$#,##0.00\"),IF(Lookup_Tables!$N$1=3,TEXT(SUMIF(LinkData!$A:$A,LEFT($M14,6),LinkData!Q:Q)/N14,\"0.00%\"))))","v":""},{"$f":"IF(Lookup_Tables!$N$1=1,\"\",IF(Lookup_Tables!$N$1=2,\"\",IF(Lookup_Tables!$N$1=3,TEXT(SUMIF(LinkData!$A:$A,LEFT($M14,6),LinkData!R:R)/N14,\"0.00%\"))))","v":""},null,null,null,null,{"$f":"N7/1","v":137}]