{"text_format":"1","workbook":"xlsx","n_sheets":4,"sheets":["Dashboard","temp","Team Performance","db"],"not_rendered":{"charts":6,"images":0,"macros":1,"external_links":0,"defined_names":8,"comments":0,"pivot_tables":0},"unopened":[],"bounds":{"document_bytes":16777216,"sheet_cells":100000,"rows_first":2000,"rows_last":500,"rows_between":2000,"halvings":0,"cell_chars":16384,"cell_head_chars":4096},"cells_cut":0,"cells_raw":0,"read":"whole","date_system":"1900"}

{"sheet":"Dashboard","index":0,"n_rows":20,"n_cols":8,"rows_kept":20,"cut":false,"hidden":false,"merged":[[0,1,0,9]]}
[null,"Team Performance Dashboard"]
[null,"Choose Your Team:"]
[]
[null,{"$f":"IF(ISTEXT(B3),\"Choose Details:\",\"\")","v":""}]
[null,{"$f":"IF(ISTEXT(B3),IF(NOT(OR(ISTEXT(C6),ISTEXT(C7))),\"Team Members\",\"\"),\"\")","v":""}]
[null,{"$f":"IF(ISTEXT(B3),IF(NOT(OR(ISTEXT(C5),ISTEXT(C7))),\"Product\",\"\"),\"\")","v":""},null,null,{"$f":"IF(ISTEXT(B3),TRANSPOSE('Team Performance'!F1:S1),\"\")","v":""},{"$f":"IF(ISTEXT($B$3),SUM(INDIRECT(\"db!\"&VLOOKUP(E6,temp!C2:D20,2,0)&\":\"&VLOOKUP(E6,temp!C2:D20,2,0))),\"\")","v":""}]
[null,{"$f":"IF(ISTEXT(B3),IF(NOT(OR(ISTEXT(C6),ISTEXT(C5))),\"Region\",\"\"),\"\")","v":""},null,null,"",{"$f":"IF(ISTEXT($B$3),SUM(INDIRECT(\"db!\"&VLOOKUP(E7,temp!C3:D21,2,0)&\":\"&VLOOKUP(E7,temp!C3:D21,2,0))),\"\")","v":""}]
[null,null,null,null,"",{"$f":"IF(ISTEXT($B$3),SUM(INDIRECT(\"db!\"&VLOOKUP(E8,temp!C4:D22,2,0)&\":\"&VLOOKUP(E8,temp!C4:D22,2,0))),\"\")","v":""}]
[null,null,null,null,"",{"$f":"IF(ISTEXT($B$3),SUM(INDIRECT(\"db!\"&VLOOKUP(E9,temp!C5:D23,2,0)&\":\"&VLOOKUP(E9,temp!C5:D23,2,0))),\"\")","v":""}]
[null,null,null,null,"",{"$f":"IF(ISTEXT($B$3),SUM(INDIRECT(\"db!\"&VLOOKUP(E10,temp!C6:D24,2,0)&\":\"&VLOOKUP(E10,temp!C6:D24,2,0))),\"\")","v":""}]
[null,null,null,null,"",{"$f":"IF(ISTEXT($B$3),SUM(INDIRECT(\"db!\"&VLOOKUP(E11,temp!C7:D25,2,0)&\":\"&VLOOKUP(E11,temp!C7:D25,2,0))),\"\")","v":""}]
[null,null,null,null,"",{"$f":"IF(ISTEXT($B$3),SUM(INDIRECT(\"db!\"&VLOOKUP(E12,temp!C8:D26,2,0)&\":\"&VLOOKUP(E12,temp!C8:D26,2,0))),\"\")","v":""}]
[null,null,null,null,"",{"$f":"IF(ISTEXT($B$3),SUM(INDIRECT(\"db!\"&VLOOKUP(E13,temp!C9:D27,2,0)&\":\"&VLOOKUP(E13,temp!C9:D27,2,0))),\"\")","v":""}]
[null,null,null,null,"",{"$f":"IF(ISTEXT($B$3),SUM(INDIRECT(\"db!\"&VLOOKUP(E14,temp!C10:D28,2,0)&\":\"&VLOOKUP(E14,temp!C10:D28,2,0))),\"\")","v":""}]
[null,null,null,null,"",{"$f":"IF(ISTEXT($B$3),SUM(INDIRECT(\"db!\"&VLOOKUP(E15,temp!C11:D29,2,0)&\":\"&VLOOKUP(E15,temp!C11:D29,2,0))),\"\")","v":""}]
[null,null,null,null,"",{"$f":"IF(ISTEXT($B$3),SUM(INDIRECT(\"db!\"&VLOOKUP(E16,temp!C12:D30,2,0)&\":\"&VLOOKUP(E16,temp!C12:D30,2,0))),\"\")","v":""}]
[null,null,null,null,"",{"$f":"IF(ISTEXT($B$3),SUM(INDIRECT(\"db!\"&VLOOKUP(E17,temp!C13:D31,2,0)&\":\"&VLOOKUP(E17,temp!C13:D31,2,0))),\"\")","v":""}]
[null,null,null,null,"",{"$f":"IF(ISTEXT($B$3),SUM(INDIRECT(\"db!\"&VLOOKUP(E18,temp!C14:D32,2,0)&\":\"&VLOOKUP(E18,temp!C14:D32,2,0))),\"\")","v":""}]
[null,null,null,null,"",{"$f":"IF(ISTEXT($B$3),SUM(INDIRECT(\"db!\"&VLOOKUP(E19,temp!C15:D33,2,0)&\":\"&VLOOKUP(E19,temp!C15:D33,2,0))),\"\")","v":""},null,"Hrvoje Očevčić"]
[null,null,null,null,null,null,null,"ocevcic@gmail.com"]

{"sheet":"temp","index":1,"n_rows":101,"n_cols":6,"rows_kept":101,"cut":false,"hidden":false,"merged":[]}
[null,null,null,null,null,"Number"]
[{"$f":"UniqueValuesX('Team Performance'!A2:A103)","v":"Team A"},null,"Team",{"$f":"LEFT(ADDRESS(1,MATCH(C2,'Team Performance'!$1:$1,0),4),1)","v":"A"},null,{"$f":"COUNTA(db!B:B)-2","v":102}]
["Team B",null,"Team Members",{"$f":"LEFT(ADDRESS(1,MATCH(C3,'Team Performance'!$1:$1,0),4),1)","v":"B"}]
["Team C",null,"Product",{"$f":"LEFT(ADDRESS(1,MATCH(C4,'Team Performance'!$1:$1,0),4),1)","v":"C"}]
["Team D",null,"Sale Date",{"$f":"LEFT(ADDRESS(1,MATCH(C5,'Team Performance'!$1:$1,0),4),1)","v":"D"}]
["Team E",null,"Region",{"$f":"LEFT(ADDRESS(1,MATCH(C6,'Team Performance'!$1:$1,0),4),1)","v":"E"}]
["Team F",null,"Login Hours",{"$f":"LEFT(ADDRESS(1,MATCH(C7,'Team Performance'!$1:$1,0),4),1)","v":"F"}]
["Team G",null,"Total Talk Time",{"$f":"LEFT(ADDRESS(1,MATCH(C8,'Team Performance'!$1:$1,0),4),1)","v":"G"}]
["Team H",null,"Total Hold Time",{"$f":"LEFT(ADDRESS(1,MATCH(C9,'Team Performance'!$1:$1,0),4),1)","v":"H"}]
["Team I",null,"Sales",{"$f":"LEFT(ADDRESS(1,MATCH(C10,'Team Performance'!$1:$1,0),4),1)","v":"I"}]
["Team J",null,"Sales Per Hour",{"$f":"LEFT(ADDRESS(1,MATCH(C11,'Team Performance'!$1:$1,0),4),1)","v":"J"}]
["",null,"Revenue",{"$f":"LEFT(ADDRESS(1,MATCH(C12,'Team Performance'!$1:$1,0),4),1)","v":"K"}]
["",null,"Revenue Per Hour",{"$f":"LEFT(ADDRESS(1,MATCH(C13,'Team Performance'!$1:$1,0),4),1)","v":"L"}]
["",null,"Calls",{"$f":"LEFT(ADDRESS(1,MATCH(C14,'Team Performance'!$1:$1,0),4),1)","v":"M"}]
["",null,"Excellent",{"$f":"LEFT(ADDRESS(1,MATCH(C15,'Team Performance'!$1:$1,0),4),1)","v":"N"}]
["",null,"Good",{"$f":"LEFT(ADDRESS(1,MATCH(C16,'Team Performance'!$1:$1,0),4),1)","v":"O"}]
["",null,"Fair",{"$f":"LEFT(ADDRESS(1,MATCH(C17,'Team Performance'!$1:$1,0),4),1)","v":"P"}]
["",null,"Poor",{"$f":"LEFT(ADDRESS(1,MATCH(C18,'Team Performance'!$1:$1,0),4),1)","v":"Q"}]
["",null,"Total",{"$f":"LEFT(ADDRESS(1,MATCH(C19,'Team Performance'!$1:$1,0),4),1)","v":"R"}]
["",null,"CSAT% (Customer Satisfaction)",{"$f":"LEFT(ADDRESS(1,MATCH(C20,'Team Performance'!$1:$1,0),4),1)","v":"S"}]
[""]
[""]
[""]
[""]
[""]
[""]
[""]
[""]
[""]
[""]
[""]
[""]
[""]
[""]
[""]
[""]
[""]
[""]
[""]
[""]
[""]
[""]
[""]
[""]
[""]
[""]
[""]
[""]
[""]
[""]
[""]
[""]
[""]
[""]
[""]
[""]
[""]
[""]
[""]
[""]
{"$rows_left_out":42}
{"sheet":"Team Performance","index":2,"n_rows":103,"n_cols":19,"rows_kept":103,"cut":false,"hidden":false,"merged":[]}
["Team","Team Members","Product","Sale Date","Region","Login Hours","Total Talk Time","Total Hold Time","Sales","Sales Per Hour","Revenue","Revenue Per Hour","Calls","Excellent","Good","Fair","Poor","Total","CSAT% (Customer Satisfaction)"]
["Team A","Sydnee","Product 1","2014-06-01","Alabama",7,6,0.5,22,3.1428571428571428,748,106.85714285714286,358,24,40,32,15,{"$f":"SUM(M2:Q2)","v":469},{"$f":"SUM(N2:O2)/R2","v":0.13646055437100213}]
["Team A","Amber","Product 2","2014-06-01","California",7.5,6.5,0.70000000000000018,19,2.5333333333333332,646,86.13333333333334,323,20,35,34,15,{"$f":"SUM(M3:Q3)","v":427},{"$f":"SUM(N3:O3)/R3","v":0.1288056206088993}]
["Team A","Constance","Product 1","2014-06-01","Colorado",8,7,0.3,16,2,544,68,310,29,32,30,11,412,0.14805825242718446]
["Team A","Nola","Product 2","2014-06-01","Connecticut",8.3000000000000007,7.3000000000000007,0.8,21,2.5301204819277108,714,86.024096385542165,327,25,36,33,12,433,0.14087759815242495]
["Team A","Libby","Product 1","2014-06-01","Florida",7.3,6.3,0.2,23,3.1506849315068495,782,107.12328767123287,367,27,37,36,12,479,0.1336116910229645]
["Team A","Tashya","Product 2","2014-06-01","Hawaii",7.9,6.9,0.6,24,3.0379746835443036,816,103.29113924050633,379,23,37,33,11,483,0.12422360248447205]
["Team A","Flavia","Product 1","2014-06-01","Alabama",7.6,6.6,0.5,15,1.9736842105263159,510,67.10526315789474,302,24,37,33,12,408,0.14950980392156862]
["Team A","Guinevere","Product 2","2014-06-01","California",7,6,0.70000000000000018,19,2.7142857142857144,646,92.285714285714292,380,21,32,33,11,477,0.1111111111111111]
["Team A","Darryl","Product 1","2014-06-01","Colorado",7.5,6.5,0.3,20,2.6666666666666665,680,90.666666666666671,394,30,38,35,13,510,0.13333333333333333]
["Team A","Farrah","Product 2","2014-06-01","Connecticut",8,7,0.8,24,3,816,102,321,27,32,40,14,434,0.13594470046082949]
["Team B","Rowan","Product 1","2014-06-01","Florida",8.3000000000000007,7.3000000000000007,0.2,25,3.012048192771084,850,102.40963855421685,348,20,38,30,10,446,0.13004484304932734]
["Team B","Quyn","Product 2","2014-06-01","Hawaii",7.3,6.3,0.6,21,2.8767123287671232,714,97.808219178082197,381,23,34,36,11,485,0.11752577319587629]
["Team B","Xantha","Product 1","2014-06-01","Alabama",7.9,6.9,0.5,24,3.0379746835443036,816,103.29113924050633,335,28,31,33,15,442,0.1334841628959276]
["Team B","Winifred","Product 2","2014-06-01","California",7.6,6.6,0.70000000000000018,18,2.3684210526315792,612,80.526315789473685,327,23,30,33,11,424,0.125]
["Team B","Iona","Product 1","2014-06-01","Colorado",7,6,0.3,23,3.2857142857142856,782,111.71428571428571,369,21,40,34,10,474,0.12869198312236288]
["Team B","Keelie","Product 2","2014-06-01","Connecticut",7.5,6.5,0.8,24,3.2,816,108.8,365,29,34,36,14,478,0.13179916317991633]
["Team B","Brynne","Product 1","2014-06-01","Florida",8,7,0.2,19,2.375,646,80.75,370,27,38,33,14,482,0.13485477178423236]
["Team B","Sierra","Product 2","2014-06-01","Hawaii",8.3000000000000007,7.3000000000000007,0.6,15,1.8072289156626504,510,61.445783132530117,302,21,34,36,13,406,0.1354679802955665]
["Team B","Gay","Product 1","2014-06-01","Alabama",7.3,6.3,0.5,18,2.4657534246575343,612,83.835616438356169,316,28,33,34,11,422,0.14454976303317535]
["Team B","Inez","Product 2","2014-06-01","California",7.9,6.9,0.70000000000000018,25,3.1645569620253164,850,107.59493670886076,330,24,32,30,10,426,0.13145539906103287]
["Team C","Illana","Product 1","2014-06-01","Colorado",7.6,6.6,0.3,15,1.9736842105263159,510,67.10526315789474,356,21,35,35,10,457,0.12253829321663019]
["Team C","Renee","Product 2","2014-06-01","Connecticut",7,6,0.8,23,3.2857142857142856,782,111.71428571428571,397,23,32,33,13,498,0.11044176706827309]
["Team C","Olympia","Product 1","2014-06-01","Florida",7.5,6.5,0.2,24,3.2,816,108.8,379,20,36,31,14,480,0.11666666666666667]
["Team C","Camille","Product 2","2014-06-01","Hawaii",8,7,0.6,21,2.625,714,89.25,348,22,30,37,14,451,0.11529933481152993]
["Team C","Shaine","Product 1","2014-06-01","Alabama",8.3000000000000007,7.3000000000000007,0.5,19,2.2891566265060237,646,77.831325301204814,356,28,38,40,14,476,0.13865546218487396]
["Team C","Maris","Product 2","2014-06-01","California",7.3,6.3,0.70000000000000018,19,2.6027397260273974,646,88.493150684931507,354,28,38,36,11,467,0.14132762312633834]
["Team C","Jana","Product 1","2014-06-01","Colorado",7.9,6.9,0.3,22,2.7848101265822782,748,94.683544303797461,341,22,30,31,14,438,0.11872146118721461]
["Team C","Audra","Product 2","2014-06-01","Connecticut",7.6,6.6,0.8,16,2.1052631578947367,544,71.578947368421055,376,28,39,33,12,488,0.13729508196721313]
["Team C","Rosalyn","Product 1","2014-06-01","Florida",7,6,0.2,16,2.2857142857142856,544,77.714285714285708,353,27,37,35,12,464,0.13793103448275862]
["Team C","April","Product 2","2014-06-01","Hawaii",7.5,6.5,0.6,15,2,510,68,324,25,32,31,14,426,0.13380281690140844]
["Team D","Dara","Product 1","2014-06-01","Alabama",8,7,0.5,18,2.25,612,76.5,364,21,32,37,13,467,0.11349036402569593]
["Team D","Daria","Product 2","2014-06-01","California",8.3000000000000007,7.3000000000000007,0.70000000000000018,20,2.4096385542168672,680,81.92771084337349,357,24,30,39,11,461,0.11713665943600868]
["Team D","Ariel","Product 1","2014-06-01","Colorado",7.3,6.3,0.3,15,2.0547945205479454,510,69.863013698630141,301,27,39,39,11,417,0.15827338129496402]
["Team D","Hermione","Product 2","2014-06-01","Connecticut",7.9,6.9,0.8,16,2.0253164556962022,544,68.860759493670884,398,29,31,33,11,502,0.11952191235059761]
["Team D","Aileen","Product 1","2014-06-01","Florida",7.6,6.6,0.2,19,2.5,646,85,324,22,36,39,14,435,0.13333333333333333]
["Team D","Cheyenne","Product 2","2014-06-01","Hawaii",7,6,0.6,19,2.7142857142857144,646,92.285714285714292,307,24,33,40,11,415,0.13734939759036144]
["Team D","Lois","Product 1","2014-06-01","Alabama",7.5,6.5,0.5,16,2.1333333333333333,544,72.533333333333331,327,28,33,37,12,437,0.13958810068649885]
["Team D","Madeson","Product 2","2014-06-01","California",8,7,0.70000000000000018,16,2,544,68,394,29,37,34,11,505,0.1306930693069307]
["Team D","Ariana","Product 1","2014-06-01","Colorado",8.3000000000000007,7.3000000000000007,0.3,24,2.8915662650602405,816,98.313253012048179,369,21,40,34,15,479,0.12734864300626306]
["Team D","Kendall","Product 2","2014-06-01","Connecticut",7.3,6.3,0.8,24,3.2876712328767126,816,111.78082191780823,338,28,35,39,15,455,0.13846153846153847]
["Team E","Lacy","Product 1","2014-06-01","Florida",7.9,6.9,0.2,22,2.7848101265822782,748,94.683544303797461,377,27,30,34,10,478,0.1192468619246862]
["Team E","Heather","Product 2","2014-06-01","Hawaii",7.6,6.6,0.6,17,2.236842105263158,578,76.05263157894737,398,28,31,32,10,499,0.11823647294589178]
["Team E","Nevada","Product 1","2014-06-01","Alabama",8.3000000000000007,7.3000000000000007,0.5,23,2.7710843373493974,782,94.216867469879503,320,23,30,39,12,424,0.125]
["Team E","Mercedes","Product 2","2014-06-01","California",7.3,6.3,0.70000000000000018,25,3.4246575342465753,850,116.43835616438356,338,24,34,33,12,441,0.13151927437641722]
["Team E","Courtney","Product 1","2014-06-01","Colorado",7.9,6.9,0.3,23,2.9113924050632911,782,98.987341772151893,371,29,30,38,12,480,0.12291666666666666]
["Team E","Amanda","Product 2","2014-06-01","Connecticut",7.6,6.6,0.8,17,2.236842105263158,578,76.05263157894737,347,20,40,35,15,457,0.13129102844638948]
["Team E","Madeline","Product 1","2014-06-01","Florida",7,6,0.2,23,3.2857142857142856,782,111.71428571428571,368,30,40,38,15,491,0.1425661914460285]
["Team E","Zia","Product 2","2014-06-01","Hawaii",7.5,6.5,0.6,25,3.3333333333333335,850,113.33333333333333,353,22,31,37,13,456,0.1162280701754386]
["Team E","Miriam","Product 1","2014-06-01","Alabama",8,7,0.5,24,3,816,102,339,30,40,30,11,450,0.15555555555555556]
["Team E","Quin","Product 2","2014-06-01","California",8.3000000000000007,7.3000000000000007,0.70000000000000018,16,1.9277108433734937,544,65.542168674698786,395,23,35,37,12,502,0.11553784860557768]
["Team F","Ivory","Product 1","2014-06-01","Colorado",7.3,6.3,0.3,19,2.6027397260273974,646,88.493150684931507,316,30,40,36,15,437,0.16018306636155608]
["Team F","Stacy","Product 2","2014-06-01","Connecticut",7.9,6.9,0.8,25,3.1645569620253164,850,107.59493670886076,383,30,30,36,10,489,0.12269938650306748]
["Team F","Dai","Product 1","2014-06-01","Florida",7.6,6.6,0.2,16,2.1052631578947367,544,71.578947368421055,336,23,38,35,10,442,0.13800904977375567]
["Team F","Shelley","Product 2","2014-06-01","Hawaii",7,6,0.6,20,2.8571428571428572,680,97.142857142857139,333,20,31,34,13,431,0.11832946635730858]
["Team F","Shelby","Product 1","2014-06-01","Alabama",7.5,6.5,0.5,22,2.9333333333333331,748,99.733333333333334,389,20,39,39,13,500,0.11799999999999999]
["Team F","Riley","Product 2","2014-06-01","California",8,7,0.70000000000000018,23,2.875,782,97.75,334,30,38,30,11,443,0.15349887133182843]
["Team F","Cleo","Product 1","2014-06-01","Colorado",8.3000000000000007,7.3000000000000007,0.3,20,2.4096385542168672,680,81.92771084337349,307,28,33,32,12,412,0.14805825242718446]
["Team F","Patricia","Product 2","2014-06-01","Connecticut",7.3,6.3,0.8,19,2.6027397260273974,646,88.493150684931507,378,24,35,37,13,487,0.12114989733059549]
["Team F","Britanney","Product 1","2014-06-01","Florida",7.9,6.9,0.2,15,1.8987341772151898,510,64.556962025316452,357,27,30,31,12,457,0.12472647702407003]
{"$rows_left_out":44}
{"sheet":"db","index":3,"n_rows":105,"n_cols":19,"rows_kept":105,"cut":false,"hidden":false,"merged":[]}
["Team","Team Members","Product","Sale Date","Region","Login Hours","Total Talk Time","Total Hold Time","Sales","Sales Per Hour","Revenue","Revenue Per Hour","Calls","Excellent","Good","Fair","Poor","Total","CSAT% (Customer Satisfaction)"]
[]
["Team","Team Members","Product","Sale Date","Region","Login Hours","Total Talk Time","Total Hold Time","Sales","Sales Per Hour","Revenue","Revenue Per Hour","Calls","Excellent","Good","Fair","Poor","Total","CSAT% (Customer Satisfaction)"]
["Team A","Sydnee","Product 1","2014-06-01","Alabama",7,6,0.5,22,3.1428571428571428,748,106.85714285714286,358,24,40,32,15,469,0.13646055437100213]
["Team A","Amber","Product 2","2014-06-01","California",7.5,6.5,0.70000000000000018,19,2.5333333333333332,646,86.13333333333334,323,20,35,34,15,427,0.1288056206088993]
["Team A","Constance","Product 1","2014-06-01","Colorado",8,7,0.3,16,2,544,68,310,29,32,30,11,412,0.14805825242718446]
["Team A","Nola","Product 2","2014-06-01","Connecticut",8.3000000000000007,7.3000000000000007,0.8,21,2.5301204819277108,714,86.024096385542165,327,25,36,33,12,433,0.14087759815242495]
["Team A","Libby","Product 1","2014-06-01","Florida",7.3,6.3,0.2,23,3.1506849315068495,782,107.12328767123287,367,27,37,36,12,479,0.1336116910229645]
["Team A","Tashya","Product 2","2014-06-01","Hawaii",7.9,6.9,0.6,24,3.0379746835443036,816,103.29113924050633,379,23,37,33,11,483,0.12422360248447205]
["Team A","Flavia","Product 1","2014-06-01","Alabama",7.6,6.6,0.5,15,1.9736842105263159,510,67.10526315789474,302,24,37,33,12,408,0.14950980392156862]
["Team A","Guinevere","Product 2","2014-06-01","California",7,6,0.70000000000000018,19,2.7142857142857144,646,92.285714285714292,380,21,32,33,11,477,0.1111111111111111]
["Team A","Darryl","Product 1","2014-06-01","Colorado",7.5,6.5,0.3,20,2.6666666666666665,680,90.666666666666671,394,30,38,35,13,510,0.13333333333333333]
["Team A","Farrah","Product 2","2014-06-01","Connecticut",8,7,0.8,24,3,816,102,321,27,32,40,14,434,0.13594470046082949]
["Team B","Rowan","Product 1","2014-06-01","Florida",8.3000000000000007,7.3000000000000007,0.2,25,3.012048192771084,850,102.40963855421685,348,20,38,30,10,446,0.13004484304932734]
["Team B","Quyn","Product 2","2014-06-01","Hawaii",7.3,6.3,0.6,21,2.8767123287671232,714,97.808219178082197,381,23,34,36,11,485,0.11752577319587629]
["Team B","Xantha","Product 1","2014-06-01","Alabama",7.9,6.9,0.5,24,3.0379746835443036,816,103.29113924050633,335,28,31,33,15,442,0.1334841628959276]
["Team B","Winifred","Product 2","2014-06-01","California",7.6,6.6,0.70000000000000018,18,2.3684210526315792,612,80.526315789473685,327,23,30,33,11,424,0.125]
["Team B","Iona","Product 1","2014-06-01","Colorado",7,6,0.3,23,3.2857142857142856,782,111.71428571428571,369,21,40,34,10,474,0.12869198312236288]
["Team B","Keelie","Product 2","2014-06-01","Connecticut",7.5,6.5,0.8,24,3.2,816,108.8,365,29,34,36,14,478,0.13179916317991633]
["Team B","Brynne","Product 1","2014-06-01","Florida",8,7,0.2,19,2.375,646,80.75,370,27,38,33,14,482,0.13485477178423236]
["Team B","Sierra","Product 2","2014-06-01","Hawaii",8.3000000000000007,7.3000000000000007,0.6,15,1.8072289156626504,510,61.445783132530117,302,21,34,36,13,406,0.1354679802955665]
["Team B","Gay","Product 1","2014-06-01","Alabama",7.3,6.3,0.5,18,2.4657534246575343,612,83.835616438356169,316,28,33,34,11,422,0.14454976303317535]
["Team B","Inez","Product 2","2014-06-01","California",7.9,6.9,0.70000000000000018,25,3.1645569620253164,850,107.59493670886076,330,24,32,30,10,426,0.13145539906103287]
["Team C","Illana","Product 1","2014-06-01","Colorado",7.6,6.6,0.3,15,1.9736842105263159,510,67.10526315789474,356,21,35,35,10,457,0.12253829321663019]
["Team C","Renee","Product 2","2014-06-01","Connecticut",7,6,0.8,23,3.2857142857142856,782,111.71428571428571,397,23,32,33,13,498,0.11044176706827309]
["Team C","Olympia","Product 1","2014-06-01","Florida",7.5,6.5,0.2,24,3.2,816,108.8,379,20,36,31,14,480,0.11666666666666667]
["Team C","Camille","Product 2","2014-06-01","Hawaii",8,7,0.6,21,2.625,714,89.25,348,22,30,37,14,451,0.11529933481152993]
["Team C","Shaine","Product 1","2014-06-01","Alabama",8.3000000000000007,7.3000000000000007,0.5,19,2.2891566265060237,646,77.831325301204814,356,28,38,40,14,476,0.13865546218487396]
["Team C","Maris","Product 2","2014-06-01","California",7.3,6.3,0.70000000000000018,19,2.6027397260273974,646,88.493150684931507,354,28,38,36,11,467,0.14132762312633834]
["Team C","Jana","Product 1","2014-06-01","Colorado",7.9,6.9,0.3,22,2.7848101265822782,748,94.683544303797461,341,22,30,31,14,438,0.11872146118721461]
["Team C","Audra","Product 2","2014-06-01","Connecticut",7.6,6.6,0.8,16,2.1052631578947367,544,71.578947368421055,376,28,39,33,12,488,0.13729508196721313]
["Team C","Rosalyn","Product 1","2014-06-01","Florida",7,6,0.2,16,2.2857142857142856,544,77.714285714285708,353,27,37,35,12,464,0.13793103448275862]
["Team C","April","Product 2","2014-06-01","Hawaii",7.5,6.5,0.6,15,2,510,68,324,25,32,31,14,426,0.13380281690140844]
["Team D","Dara","Product 1","2014-06-01","Alabama",8,7,0.5,18,2.25,612,76.5,364,21,32,37,13,467,0.11349036402569593]
["Team D","Daria","Product 2","2014-06-01","California",8.3000000000000007,7.3000000000000007,0.70000000000000018,20,2.4096385542168672,680,81.92771084337349,357,24,30,39,11,461,0.11713665943600868]
["Team D","Ariel","Product 1","2014-06-01","Colorado",7.3,6.3,0.3,15,2.0547945205479454,510,69.863013698630141,301,27,39,39,11,417,0.15827338129496402]
["Team D","Hermione","Product 2","2014-06-01","Connecticut",7.9,6.9,0.8,16,2.0253164556962022,544,68.860759493670884,398,29,31,33,11,502,0.11952191235059761]
["Team D","Aileen","Product 1","2014-06-01","Florida",7.6,6.6,0.2,19,2.5,646,85,324,22,36,39,14,435,0.13333333333333333]
["Team D","Cheyenne","Product 2","2014-06-01","Hawaii",7,6,0.6,19,2.7142857142857144,646,92.285714285714292,307,24,33,40,11,415,0.13734939759036144]
["Team D","Lois","Product 1","2014-06-01","Alabama",7.5,6.5,0.5,16,2.1333333333333333,544,72.533333333333331,327,28,33,37,12,437,0.13958810068649885]
["Team D","Madeson","Product 2","2014-06-01","California",8,7,0.70000000000000018,16,2,544,68,394,29,37,34,11,505,0.1306930693069307]
["Team D","Ariana","Product 1","2014-06-01","Colorado",8.3000000000000007,7.3000000000000007,0.3,24,2.8915662650602405,816,98.313253012048179,369,21,40,34,15,479,0.12734864300626306]
["Team D","Kendall","Product 2","2014-06-01","Connecticut",7.3,6.3,0.8,24,3.2876712328767126,816,111.78082191780823,338,28,35,39,15,455,0.13846153846153847]
["Team E","Lacy","Product 1","2014-06-01","Florida",7.9,6.9,0.2,22,2.7848101265822782,748,94.683544303797461,377,27,30,34,10,478,0.1192468619246862]
["Team E","Heather","Product 2","2014-06-01","Hawaii",7.6,6.6,0.6,17,2.236842105263158,578,76.05263157894737,398,28,31,32,10,499,0.11823647294589178]
["Team E","Nevada","Product 1","2014-06-01","Alabama",8.3000000000000007,7.3000000000000007,0.5,23,2.7710843373493974,782,94.216867469879503,320,23,30,39,12,424,0.125]
["Team E","Mercedes","Product 2","2014-06-01","California",7.3,6.3,0.70000000000000018,25,3.4246575342465753,850,116.43835616438356,338,24,34,33,12,441,0.13151927437641722]
["Team E","Courtney","Product 1","2014-06-01","Colorado",7.9,6.9,0.3,23,2.9113924050632911,782,98.987341772151893,371,29,30,38,12,480,0.12291666666666666]
["Team E","Amanda","Product 2","2014-06-01","Connecticut",7.6,6.6,0.8,17,2.236842105263158,578,76.05263157894737,347,20,40,35,15,457,0.13129102844638948]
["Team E","Madeline","Product 1","2014-06-01","Florida",7,6,0.2,23,3.2857142857142856,782,111.71428571428571,368,30,40,38,15,491,0.1425661914460285]
["Team E","Zia","Product 2","2014-06-01","Hawaii",7.5,6.5,0.6,25,3.3333333333333335,850,113.33333333333333,353,22,31,37,13,456,0.1162280701754386]
["Team E","Miriam","Product 1","2014-06-01","Alabama",8,7,0.5,24,3,816,102,339,30,40,30,11,450,0.15555555555555556]
["Team E","Quin","Product 2","2014-06-01","California",8.3000000000000007,7.3000000000000007,0.70000000000000018,16,1.9277108433734937,544,65.542168674698786,395,23,35,37,12,502,0.11553784860557768]
["Team F","Ivory","Product 1","2014-06-01","Colorado",7.3,6.3,0.3,19,2.6027397260273974,646,88.493150684931507,316,30,40,36,15,437,0.16018306636155608]
["Team F","Stacy","Product 2","2014-06-01","Connecticut",7.9,6.9,0.8,25,3.1645569620253164,850,107.59493670886076,383,30,30,36,10,489,0.12269938650306748]
["Team F","Dai","Product 1","2014-06-01","Florida",7.6,6.6,0.2,16,2.1052631578947367,544,71.578947368421055,336,23,38,35,10,442,0.13800904977375567]
["Team F","Shelley","Product 2","2014-06-01","Hawaii",7,6,0.6,20,2.8571428571428572,680,97.142857142857139,333,20,31,34,13,431,0.11832946635730858]
["Team F","Shelby","Product 1","2014-06-01","Alabama",7.5,6.5,0.5,22,2.9333333333333331,748,99.733333333333334,389,20,39,39,13,500,0.11799999999999999]
["Team F","Riley","Product 2","2014-06-01","California",8,7,0.70000000000000018,23,2.875,782,97.75,334,30,38,30,11,443,0.15349887133182843]
["Team F","Cleo","Product 1","2014-06-01","Colorado",8.3000000000000007,7.3000000000000007,0.3,20,2.4096385542168672,680,81.92771084337349,307,28,33,32,12,412,0.14805825242718446]
{"$rows_left_out":45}