{"text_format":"1","workbook":"xlsx","n_sheets":5,"sheets":["Pivot","Intro","Data","Controls","Dashboard"],"not_rendered":{"charts":4,"images":0,"macros":1,"external_links":0,"defined_names":33,"comments":0,"pivot_tables":4},"unopened":[],"bounds":{"document_bytes":16777216,"sheet_cells":100000,"rows_first":2000,"rows_last":500,"rows_between":2000,"halvings":0,"cell_chars":16384,"cell_head_chars":4096},"cells_cut":0,"cells_raw":0,"read":"whole","date_system":"1900"}

{"sheet":"Pivot","index":0,"n_rows":30,"n_cols":15,"rows_kept":30,"cut":false,"hidden":true,"merged":[[1,3,1,6]]}
[]
[null,null,null,{"$f":"B4&\" comparison \" & CHAR(10) &\" 2011 vs. 2012\"","v":"Person 4 comparison \n 2011 vs. 2012"}]
[]
["Sales Person - Name","Person 4",null,null,null,4,null,null,null,"Customer Type","Customer 1",null,null,"Customer Type","Customer 1"]
[]
["Row Labels","Sum of 2011","Sum of 2012",null,{"$f":"INDEX(Controls!$E$3:$E$14,Pivot!F4)","v":"Person 4"},2011,2012,null,null,"Product","Sum of 2011",null,null,"Product","Sum of 2012"]
["Product 1",8478,8806,null,{"$f":"\"Prod \"& CHAR(10) & 1","v":"Prod \n1"},8478,8806,null,null,"Product 4",0.38554184404806813,null,null,"Product 9",0.37813689261485856]
["Product 2",8346,8368,null,{"$f":"\"Prod \"& CHAR(10) & 2","v":"Prod \n2"},8346,8368,null,null,"Product 9",0.35873255375330065,null,null,"Product 4",0.36823672163697535]
["Product 3",8370,8100,null,{"$f":"\"Prod \"& CHAR(10) & 3","v":"Prod \n3"},8370,8100,null,null,"Product 5",0.25572560219863122,null,null,"Product 10",0.25362638574816615]
["Product 4",8783,8623,null,{"$f":"\"Prod \"& CHAR(10) & 4","v":"Prod \n4"},8783,8623,null,null,"Grand Total",1,null,null,"Grand Total",1]
["Product 5",13716,12544,null,{"$f":"\"Prod \"& CHAR(10) & 5","v":"Prod \n5"},13716,12544]
["Product 6",8782,8763,null,{"$f":"\"Prod \"& CHAR(10) & 6","v":"Prod \n6"},8782,8763]
["Product 7",8120,8470,null,{"$f":"\"Prod \"& CHAR(10) & 7","v":"Prod \n7"},8120,8470]
["Product 8",8413,8572,null,{"$f":"\"Prod \"& CHAR(10) & 8","v":"Prod \n8"},8413,8572]
["Product 9",9699,9256,null,{"$f":"\"Prod \"& CHAR(10) & 9","v":"Prod \n9"},9699,9256,null,null,"Customer Type","Customer 1"]
["Product 10",13200,13429,null,{"$f":"\"Prod \"& CHAR(10) & 10","v":"Prod \n10"},13200,13429]
["Product 11",8860,8996,null,{"$f":"\"Prod \"& CHAR(10) & 11","v":"Prod \n11"},8860,8996,null,null,"Product","Sum of 2011","Sum of 2012"]
["Product 12",8344,8579,null,{"$f":"\"Prod \"& CHAR(10) & 12","v":"Prod \n12"},8344,8579,null,null,"Product 1",8214,8141]
["Grand Total",113111,112506,null,null,{"$f":"SUM(F7:F18)","v":113111},{"$f":"SUM(G7:G18)","v":112506},null,null,"Product 2",8174,8189]
[null,null,null,null,null,null,{"$f":"G19/F19*100","v":99.465127175959907},null,null,"Product 3",8451,9106]
[null,null,null,null,{"$f":"Salesrep&\" Index of \" &TEXT(G20,\"#,##\")&CHAR(10)& \" 2012 over 2011\"","v":"Person 4 Index of 99\n 2012 over 2011"},null,null,null,null,"Product 4",14309,13353]
[null,null,null,null,null,null,null,null,null,"Product 5",9491,8599]
[null,null,null,null,null,null,null,null,null,"Product 6",8376,8332]
[null,null,null,null,null,null,null,null,null,"Product 7",8320,7733]
[null,null,null,null,null,null,null,null,null,"Product 8",8584,8628]
[null,null,null,null,null,null,null,null,null,"Product 9",13314,13712]
[null,null,null,null,null,null,null,null,null,"Product 10",9035,9197]
[null,null,null,null,null,null,null,null,null,"Product 11",8076,8554]
[null,null,null,null,null,null,null,null,null,"Product 12",7807,8434]
[null,null,null,null,null,null,null,null,null,"Grand Total",112151,111978]

{"sheet":"Intro","index":1,"n_rows":0,"n_cols":0,"rows_kept":0,"cut":false,"hidden":false,"merged":[]}

{"sheet":"Data","index":2,"n_rows":146,"n_cols":30,"rows_kept":146,"cut":false,"hidden":false,"merged":[[0,4,0,27]]}
[null,null,null,null,"Sales"]
["Region","Product","Customer Type","Sales Person - Name","2011-01-01","2011-02-01","2011-03-01","2011-04-01","2011-05-01","2011-06-01","2011-07-01","2011-08-01","2011-09-01","2011-10-01","2011-11-01","2011-12-01","2012-01-01","2012-02-01","2012-03-01","2012-04-01","2012-05-01","2012-06-01","2012-07-01","2012-08-01","2012-09-01","2012-10-01","2012-11-01","2012-12-01",2011,2012]
["Region 1","Product 1","Customer 1","Person 1",717,641,654,752,595,769,793,710,564,677,619,723,639,757,746,758,562,563,782,559,640,669,774,692,{"$f":"SUM(E3:P3)","v":8214},{"$f":"SUM(Q3:AB3)","v":8141}]
["Region 1","Product 1","Customer 2","Person 2",1400,1220,1114,899,1351,835,873,909,888,1278,1350,1348,931,1298,1164,800,903,958,836,909,853,918,1223,886,{"$f":"SUM(E4:P4)","v":13465},{"$f":"SUM(Q4:AB4)","v":11679}]
["Region 1","Product 1","Customer 3","Person 3",696,643,644,596,645,649,612,675,794,591,709,561,733,771,792,577,586,727,678,753,652,689,767,643,7815,8368]
["Region 1","Product 1","Customer 4","Person 4",732,628,628,667,819,640,850,755,612,644,622,881,854,766,713,784,667,711,733,677,637,815,756,693,8478,8806]
["Region 1","Product 1","Customer 5","Person 5",607,602,636,869,847,806,895,835,843,799,834,785,744,858,799,677,867,605,828,620,655,704,784,635,9358,8776]
["Region 1","Product 1","Customer 6","Person 6",800,607,737,621,660,733,743,666,630,644,617,695,653,648,788,731,710,745,788,756,627,669,731,650,8153,8496]
["Region 1","Product 1","Customer 7","Person 7",1064,863,1316,1141,933,872,1185,1358,1173,1343,1164,1275,1364,828,1299,863,910,1146,915,941,1093,1224,938,946,13687,12467]
["Region 1","Product 1","Customer 8","Person 8",667,609,780,559,673,727,730,550,787,609,762,604,555,747,640,649,565,725,602,594,799,721,786,589,8057,7972]
["Region 1","Product 1","Customer 9","Person 9",890,751,645,807,845,820,832,771,724,696,657,899,693,705,749,758,774,652,801,815,649,638,615,896,9337,8745]
["Region 1","Product 1","Customer 10","Person 10",711,624,804,885,873,628,666,648,879,779,782,605,830,775,895,707,826,719,845,615,839,779,822,866,8884,9518]
["Region 1","Product 1","Customer 11","Person 11",651,788,748,703,701,692,771,738,646,608,786,737,603,604,632,680,729,756,795,772,663,768,735,683,8569,8420]
["Region 1","Product 1","Customer 12","Person 12",1075,1154,866,1055,990,1364,934,1193,1161,1323,1060,1058,1117,944,1004,1172,1074,1283,840,1050,1031,852,1192,1113,13233,12672]
["Region 1","Product 2","Customer 1","Person 1",580,682,641,761,759,787,595,654,763,591,639,722,745,685,678,641,600,690,766,783,662,592,636,711,8174,8189]
["Region 1","Product 2","Customer 2","Person 2",756,790,609,886,656,620,668,786,755,738,742,655,793,647,653,856,687,744,874,795,881,806,772,883,8661,9391]
["Region 1","Product 2","Customer 3","Person 3",779,659,813,800,859,844,714,764,881,693,739,753,860,872,833,833,835,870,863,896,775,867,617,702,9298,9823]
["Region 1","Product 2","Customer 4","Person 4",658,681,756,717,621,766,780,712,765,620,651,619,682,696,749,757,735,654,729,755,677,610,700,624,8346,8368]
["Region 1","Product 2","Customer 5","Person 5",1230,817,1030,1078,1093,1172,1323,1053,1121,1301,1103,1190,1248,1007,1003,908,830,1107,800,1117,1189,1352,1084,1012,13511,12657]
["Region 1","Product 2","Customer 6","Person 6",727,586,583,673,706,610,645,556,560,646,658,592,630,576,657,574,586,600,625,568,597,698,588,596,7542,7295]
["Region 1","Product 2","Customer 7","Person 7",642,778,843,881,726,850,827,759,721,618,757,899,632,853,824,833,880,787,760,726,637,669,844,875,9301,9320]
["Region 1","Product 2","Customer 8","Person 8",888,697,861,701,748,779,850,744,720,613,651,870,651,871,870,725,691,848,689,847,615,706,755,754,9122,9022]
["Region 1","Product 2","Customer 9","Person 9",605,749,605,729,600,795,695,680,606,782,765,774,767,705,740,627,696,615,693,626,625,712,710,728,8385,8244]
["Region 1","Product 2","Customer 10","Person 10",1073,1161,905,1017,895,1224,1130,1314,1213,1254,942,903,870,1151,807,878,1325,804,905,1057,1193,1375,923,1093,13031,12381]
["Region 1","Product 2","Customer 11","Person 11",689,688,737,759,581,608,576,704,789,617,743,684,617,554,638,611,614,697,721,691,771,570,704,764,8175,7952]
["Region 1","Product 2","Customer 12","Person 12",715,636,679,832,780,711,879,660,880,737,602,735,684,721,838,806,855,872,605,675,802,662,600,721,8846,8841]
["Region 1","Product 3","Customer 1","Person 1",637,646,671,714,744,786,784,697,636,654,760,722,889,631,744,834,670,853,830,827,650,696,631,851,8451,9106]
["Region 1","Product 3","Customer 2","Person 2",692,716,645,726,681,601,733,627,783,614,602,705,756,746,623,682,780,672,679,624,751,727,779,761,8125,8580]
["Region 1","Product 3","Customer 3","Person 3",1284,1302,1316,1210,823,1206,1253,1043,1223,1400,1094,881,1006,1045,1173,1102,1065,1363,1132,1212,1196,1189,962,1359,14035,13804]
["Region 1","Product 3","Customer 4","Person 4",660,750,649,652,738,694,756,551,768,647,725,780,608,673,752,698,642,671,575,633,704,652,717,775,8370,8100]
["Region 1","Product 3","Customer 5","Person 5",880,775,830,713,825,722,779,768,715,708,664,609,822,630,652,732,733,849,880,848,850,788,768,612,8988,9164]
["Region 1","Product 3","Customer 6","Person 6",804,646,608,674,698,850,617,751,655,656,673,877,608,794,631,743,843,800,705,860,686,896,663,779,8509,9008]
["Region 1","Product 3","Customer 7","Person 7",712,663,689,778,603,785,600,776,714,785,681,762,634,720,780,789,644,606,683,708,718,773,600,777,8548,8432]
["Region 1","Product 3","Customer 8","Person 8",826,1022,1238,993,1219,1107,965,867,1205,872,892,944,1281,993,1254,1366,834,883,898,1255,1114,1137,900,1291,12150,13206]
["Region 1","Product 3","Customer 9","Person 9",786,614,706,763,695,648,728,578,680,573,701,645,795,763,674,628,559,702,685,663,550,708,680,776,8117,8183]
["Region 1","Product 3","Customer 10","Person 10",800,674,757,825,779,751,693,608,675,705,892,653,608,619,814,823,759,740,873,731,796,866,773,878,8812,9280]
["Region 1","Product 3","Customer 11","Person 11",754,664,667,787,894,740,803,883,755,708,612,730,832,674,771,704,867,791,747,695,704,671,874,829,8997,9159]
["Region 1","Product 3","Customer 12","Person 12",782,660,631,685,646,605,701,709,699,725,725,753,665,645,698,682,779,757,773,778,726,652,776,724,8321,8655]
["Region 2","Product 4","Customer 1","Person 1",1194,1397,1397,1064,1211,1183,827,1088,1394,1076,1106,1372,1107,871,910,1305,1054,1122,1314,1360,801,1275,1316,918,14309,13353]
["Region 2","Product 4","Customer 2","Person 2",733,607,647,786,719,775,567,620,577,671,689,762,609,780,753,590,696,695,581,739,564,598,634,689,8153,7928]
{"$rows_left_out":107}
{"sheet":"Controls","index":3,"n_rows":31,"n_cols":19,"rows_kept":31,"cut":false,"hidden":true,"merged":[]}
[]
[null,"Region","Product","Customer Type","Sales Person - Name",null,"Region","Product 1","Product 2","Product 3","Product 4","Product 5","Product 6","Product 7","Product 8","Product 9","Product 10","Product 11","Product 12"]
[null,"Region 1","Product 1","Customer 1","Person 1",null,"Region 1",{"$f":"SUMIFS(INDIRECT(Dashboard!$G$16),Region,Controls!$G3,Product,Controls!H$2)","v":9701},{"$f":"SUMIFS(INDIRECT(Dashboard!$G$16),Region,Controls!$G3,Product,Controls!I$2)","v":9774},{"$f":"SUMIFS(INDIRECT(Dashboard!$G$16),Region,Controls!$G3,Product,Controls!J$2)","v":9508},{"$f":"SUMIFS(INDIRECT(Dashboard!$G$16),Region,Controls!$G3,Product,Controls!K$2)","v":0},{"$f":"SUMIFS(INDIRECT(Dashboard!$G$16),Region,Controls!$G3,Product,Controls!L$2)","v":0},{"$f":"SUMIFS(INDIRECT(Dashboard!$G$16),Region,Controls!$G3,Product,Controls!M$2)","v":0},{"$f":"SUMIFS(INDIRECT(Dashboard!$G$16),Region,Controls!$G3,Product,Controls!N$2)","v":0},{"$f":"SUMIFS(INDIRECT(Dashboard!$G$16),Region,Controls!$G3,Product,Controls!O$2)","v":0},{"$f":"SUMIFS(INDIRECT(Dashboard!$G$16),Region,Controls!$G3,Product,Controls!P$2)","v":0},{"$f":"SUMIFS(INDIRECT(Dashboard!$G$16),Region,Controls!$G3,Product,Controls!Q$2)","v":0},{"$f":"SUMIFS(INDIRECT(Dashboard!$G$16),Region,Controls!$G3,Product,Controls!R$2)","v":0},{"$f":"SUMIFS(INDIRECT(Dashboard!$G$16),Region,Controls!$G3,Product,Controls!S$2)","v":0}]
[null,"Region 2","Product 2","Customer 2","Person 2",null,"Region 2",{"$f":"SUMIFS(INDIRECT(Dashboard!$G$16),Region,Controls!$G4,Product,Controls!H$2)","v":0},{"$f":"SUMIFS(INDIRECT(Dashboard!$G$16),Region,Controls!$G4,Product,Controls!I$2)","v":0},{"$f":"SUMIFS(INDIRECT(Dashboard!$G$16),Region,Controls!$G4,Product,Controls!J$2)","v":0},{"$f":"SUMIFS(INDIRECT(Dashboard!$G$16),Region,Controls!$G4,Product,Controls!K$2)","v":9701},{"$f":"SUMIFS(INDIRECT(Dashboard!$G$16),Region,Controls!$G4,Product,Controls!L$2)","v":9616},{"$f":"SUMIFS(INDIRECT(Dashboard!$G$16),Region,Controls!$G4,Product,Controls!M$2)","v":9856},{"$f":"SUMIFS(INDIRECT(Dashboard!$G$16),Region,Controls!$G4,Product,Controls!N$2)","v":0},{"$f":"SUMIFS(INDIRECT(Dashboard!$G$16),Region,Controls!$G4,Product,Controls!O$2)","v":0},{"$f":"SUMIFS(INDIRECT(Dashboard!$G$16),Region,Controls!$G4,Product,Controls!P$2)","v":0},{"$f":"SUMIFS(INDIRECT(Dashboard!$G$16),Region,Controls!$G4,Product,Controls!Q$2)","v":0},{"$f":"SUMIFS(INDIRECT(Dashboard!$G$16),Region,Controls!$G4,Product,Controls!R$2)","v":0},{"$f":"SUMIFS(INDIRECT(Dashboard!$G$16),Region,Controls!$G4,Product,Controls!S$2)","v":0}]
[null,"Region 3","Product 3","Customer 3","Person 3",null,"Region 3",{"$f":"SUMIFS(INDIRECT(Dashboard!$G$16),Region,Controls!$G5,Product,Controls!H$2)","v":0},{"$f":"SUMIFS(INDIRECT(Dashboard!$G$16),Region,Controls!$G5,Product,Controls!I$2)","v":0},{"$f":"SUMIFS(INDIRECT(Dashboard!$G$16),Region,Controls!$G5,Product,Controls!J$2)","v":0},{"$f":"SUMIFS(INDIRECT(Dashboard!$G$16),Region,Controls!$G5,Product,Controls!K$2)","v":0},{"$f":"SUMIFS(INDIRECT(Dashboard!$G$16),Region,Controls!$G5,Product,Controls!L$2)","v":0},{"$f":"SUMIFS(INDIRECT(Dashboard!$G$16),Region,Controls!$G5,Product,Controls!M$2)","v":0},{"$f":"SUMIFS(INDIRECT(Dashboard!$G$16),Region,Controls!$G5,Product,Controls!N$2)","v":9517},{"$f":"SUMIFS(INDIRECT(Dashboard!$G$16),Region,Controls!$G5,Product,Controls!O$2)","v":9116},{"$f":"SUMIFS(INDIRECT(Dashboard!$G$16),Region,Controls!$G5,Product,Controls!P$2)","v":10243},{"$f":"SUMIFS(INDIRECT(Dashboard!$G$16),Region,Controls!$G5,Product,Controls!Q$2)","v":0},{"$f":"SUMIFS(INDIRECT(Dashboard!$G$16),Region,Controls!$G5,Product,Controls!R$2)","v":0},{"$f":"SUMIFS(INDIRECT(Dashboard!$G$16),Region,Controls!$G5,Product,Controls!S$2)","v":0}]
[null,"Region 4","Product 4","Customer 4","Person 4",null,"Region 4",{"$f":"SUMIFS(INDIRECT(Dashboard!$G$16),Region,Controls!$G6,Product,Controls!H$2)","v":0},{"$f":"SUMIFS(INDIRECT(Dashboard!$G$16),Region,Controls!$G6,Product,Controls!I$2)","v":0},{"$f":"SUMIFS(INDIRECT(Dashboard!$G$16),Region,Controls!$G6,Product,Controls!J$2)","v":0},{"$f":"SUMIFS(INDIRECT(Dashboard!$G$16),Region,Controls!$G6,Product,Controls!K$2)","v":0},{"$f":"SUMIFS(INDIRECT(Dashboard!$G$16),Region,Controls!$G6,Product,Controls!L$2)","v":0},{"$f":"SUMIFS(INDIRECT(Dashboard!$G$16),Region,Controls!$G6,Product,Controls!M$2)","v":0},{"$f":"SUMIFS(INDIRECT(Dashboard!$G$16),Region,Controls!$G6,Product,Controls!N$2)","v":0},{"$f":"SUMIFS(INDIRECT(Dashboard!$G$16),Region,Controls!$G6,Product,Controls!O$2)","v":0},{"$f":"SUMIFS(INDIRECT(Dashboard!$G$16),Region,Controls!$G6,Product,Controls!P$2)","v":0},{"$f":"SUMIFS(INDIRECT(Dashboard!$G$16),Region,Controls!$G6,Product,Controls!Q$2)","v":9425},{"$f":"SUMIFS(INDIRECT(Dashboard!$G$16),Region,Controls!$G6,Product,Controls!R$2)","v":9362},{"$f":"SUMIFS(INDIRECT(Dashboard!$G$16),Region,Controls!$G6,Product,Controls!S$2)","v":9431}]
[null,null,"Product 5","Customer 5","Person 5"]
[null,null,"Product 6","Customer 6","Person 6",null,"Region","Product 1","Product 2","Product 3","Product 4","Product 5","Product 6","Product 7","Product 8","Product 9","Product 10","Product 11","Product 12"]
[null,null,"Product 7","Customer 7","Person 7",null,"Region 1",{"$f":"SUMIFS(INDIRECT(Dashboard!$H$16),Region,Controls!$G9,Product,Controls!H$8)","v":9138},{"$f":"SUMIFS(INDIRECT(Dashboard!$H$16),Region,Controls!$G9,Product,Controls!I$8)","v":9424},{"$f":"SUMIFS(INDIRECT(Dashboard!$H$16),Region,Controls!$G9,Product,Controls!J$8)","v":9445},{"$f":"SUMIFS(INDIRECT(Dashboard!$H$16),Region,Controls!$G9,Product,Controls!K$8)","v":0},{"$f":"SUMIFS(INDIRECT(Dashboard!$H$16),Region,Controls!$G9,Product,Controls!L$8)","v":0},{"$f":"SUMIFS(INDIRECT(Dashboard!$H$16),Region,Controls!$G9,Product,Controls!M$8)","v":0},{"$f":"SUMIFS(INDIRECT(Dashboard!$H$16),Region,Controls!$G9,Product,Controls!N$8)","v":0},{"$f":"SUMIFS(INDIRECT(Dashboard!$H$16),Region,Controls!$G9,Product,Controls!O$8)","v":0},{"$f":"SUMIFS(INDIRECT(Dashboard!$H$16),Region,Controls!$G9,Product,Controls!P$8)","v":0},{"$f":"SUMIFS(INDIRECT(Dashboard!$H$16),Region,Controls!$G9,Product,Controls!Q$8)","v":0},{"$f":"SUMIFS(INDIRECT(Dashboard!$H$16),Region,Controls!$G9,Product,Controls!R$8)","v":0},{"$f":"SUMIFS(INDIRECT(Dashboard!$H$16),Region,Controls!$G9,Product,Controls!S$8)","v":0}]
[null,null,"Product 8","Customer 8","Person 8",null,"Region 2",{"$f":"SUMIFS(INDIRECT(Dashboard!$H$16),Region,Controls!$G10,Product,Controls!H$8)","v":0},{"$f":"SUMIFS(INDIRECT(Dashboard!$H$16),Region,Controls!$G10,Product,Controls!I$8)","v":0},{"$f":"SUMIFS(INDIRECT(Dashboard!$H$16),Region,Controls!$G10,Product,Controls!J$8)","v":0},{"$f":"SUMIFS(INDIRECT(Dashboard!$H$16),Region,Controls!$G10,Product,Controls!K$8)","v":9697},{"$f":"SUMIFS(INDIRECT(Dashboard!$H$16),Region,Controls!$G10,Product,Controls!L$8)","v":9210},{"$f":"SUMIFS(INDIRECT(Dashboard!$H$16),Region,Controls!$G10,Product,Controls!M$8)","v":9542},{"$f":"SUMIFS(INDIRECT(Dashboard!$H$16),Region,Controls!$G10,Product,Controls!N$8)","v":0},{"$f":"SUMIFS(INDIRECT(Dashboard!$H$16),Region,Controls!$G10,Product,Controls!O$8)","v":0},{"$f":"SUMIFS(INDIRECT(Dashboard!$H$16),Region,Controls!$G10,Product,Controls!P$8)","v":0},{"$f":"SUMIFS(INDIRECT(Dashboard!$H$16),Region,Controls!$G10,Product,Controls!Q$8)","v":0},{"$f":"SUMIFS(INDIRECT(Dashboard!$H$16),Region,Controls!$G10,Product,Controls!R$8)","v":0},{"$f":"SUMIFS(INDIRECT(Dashboard!$H$16),Region,Controls!$G10,Product,Controls!S$8)","v":0}]
[null,null,"Product 9","Customer 9","Person 9",null,"Region 3",{"$f":"SUMIFS(INDIRECT(Dashboard!$H$16),Region,Controls!$G11,Product,Controls!H$8)","v":0},{"$f":"SUMIFS(INDIRECT(Dashboard!$H$16),Region,Controls!$G11,Product,Controls!I$8)","v":0},{"$f":"SUMIFS(INDIRECT(Dashboard!$H$16),Region,Controls!$G11,Product,Controls!J$8)","v":0},{"$f":"SUMIFS(INDIRECT(Dashboard!$H$16),Region,Controls!$G11,Product,Controls!K$8)","v":0},{"$f":"SUMIFS(INDIRECT(Dashboard!$H$16),Region,Controls!$G11,Product,Controls!L$8)","v":0},{"$f":"SUMIFS(INDIRECT(Dashboard!$H$16),Region,Controls!$G11,Product,Controls!M$8)","v":0},{"$f":"SUMIFS(INDIRECT(Dashboard!$H$16),Region,Controls!$G11,Product,Controls!N$8)","v":9992},{"$f":"SUMIFS(INDIRECT(Dashboard!$H$16),Region,Controls!$G11,Product,Controls!O$8)","v":9010},{"$f":"SUMIFS(INDIRECT(Dashboard!$H$16),Region,Controls!$G11,Product,Controls!P$8)","v":9736},{"$f":"SUMIFS(INDIRECT(Dashboard!$H$16),Region,Controls!$G11,Product,Controls!Q$8)","v":0},{"$f":"SUMIFS(INDIRECT(Dashboard!$H$16),Region,Controls!$G11,Product,Controls!R$8)","v":0},{"$f":"SUMIFS(INDIRECT(Dashboard!$H$16),Region,Controls!$G11,Product,Controls!S$8)","v":0}]
[null,null,"Product 10","Customer 10","Person 10",null,"Region 4",{"$f":"SUMIFS(INDIRECT(Dashboard!$H$16),Region,Controls!$G12,Product,Controls!H$8)","v":0},{"$f":"SUMIFS(INDIRECT(Dashboard!$H$16),Region,Controls!$G12,Product,Controls!I$8)","v":0},{"$f":"SUMIFS(INDIRECT(Dashboard!$H$16),Region,Controls!$G12,Product,Controls!J$8)","v":0},{"$f":"SUMIFS(INDIRECT(Dashboard!$H$16),Region,Controls!$G12,Product,Controls!K$8)","v":0},{"$f":"SUMIFS(INDIRECT(Dashboard!$H$16),Region,Controls!$G12,Product,Controls!L$8)","v":0},{"$f":"SUMIFS(INDIRECT(Dashboard!$H$16),Region,Controls!$G12,Product,Controls!M$8)","v":0},{"$f":"SUMIFS(INDIRECT(Dashboard!$H$16),Region,Controls!$G12,Product,Controls!N$8)","v":0},{"$f":"SUMIFS(INDIRECT(Dashboard!$H$16),Region,Controls!$G12,Product,Controls!O$8)","v":0},{"$f":"SUMIFS(INDIRECT(Dashboard!$H$16),Region,Controls!$G12,Product,Controls!P$8)","v":0},{"$f":"SUMIFS(INDIRECT(Dashboard!$H$16),Region,Controls!$G12,Product,Controls!Q$8)","v":10011},{"$f":"SUMIFS(INDIRECT(Dashboard!$H$16),Region,Controls!$G12,Product,Controls!R$8)","v":10094},{"$f":"SUMIFS(INDIRECT(Dashboard!$H$16),Region,Controls!$G12,Product,Controls!S$8)","v":9559}]
[null,null,"Product 11","Customer 11","Person 11",null,null,null,{"$f":"IF(G14=1,2,IF(G14=2,5,IF(G14=3,8,11)))","v":5},{"$f":"I13+1","v":6},{"$f":"J13+1","v":7}]
[null,null,"Product 12","Customer 12","Person 12",null,2,{"$f":"CHOOSE(G14,G9,G10,G11,G12)","v":"Region 2"},{"$f":"IF($G$14=1,H8,IF($G$14=2,K8,IF($G$14=3,N8,Q8)))","v":"Product 4"},{"$f":"IF($G$14=1,I8,IF($G$14=2,L8,IF($G$14=3,O8,R8)))","v":"Product 5"},{"$f":"IF($G$14=1,J8,IF($G$14=2,M8,IF($G$14=3,P8,S8)))","v":"Product 6"}]
[null,null,null,null,null,null,null,null,{"$f":"IF($G$14=1,VLOOKUP($H$14,$G$3:$S$6,I$13,FALSE),IF($G$14=2,VLOOKUP($H$14,$G$3:$S$6,I$13,FALSE),IF($G$14=3,VLOOKUP($H$14,$G$3:$S$6,I13,FALSE),VLOOKUP($H$14,$G$3:$S$6,I$13,FALSE))))","v":9701},{"$f":"IF($G$14=1,VLOOKUP($H$14,$G$3:$S$6,J$13,FALSE),IF($G$14=2,VLOOKUP($H$14,$G$3:$S$6,J$13,FALSE),IF($G$14=3,VLOOKUP($H$14,$G$3:$S$6,J13,FALSE),VLOOKUP($H$14,$G$3:$S$6,J$13,FALSE))))","v":9616},9856,2011]
[null,null,null,null,null,null,null,null,{"$f":"IF($G$14=1,VLOOKUP($H$14,$G$9:$S$12,I$13,FALSE),IF($G$14=2,VLOOKUP($H$14,$G$9:$S$12,I$13,FALSE),IF($G$14=3,VLOOKUP($H$14,$G$9:$S$12,I$13,FALSE),VLOOKUP($H$14,$G$9:$S$12,I$13,FALSE))))","v":9697},{"$f":"IF($G$14=1,VLOOKUP($H$14,$G$9:$S$12,J$13,FALSE),IF($G$14=2,VLOOKUP($H$14,$G$9:$S$12,J$13,FALSE),IF($G$14=3,VLOOKUP($H$14,$G$9:$S$12,J$13,FALSE),VLOOKUP($H$14,$G$9:$S$12,J$13,FALSE))))","v":9210},9542,2012]
[null,null,"Jan_11","Jan_12"]
[null,null,"Feb_11","Feb_12"]
[null,null,"Mar_11","Mar_12",null,null,"Product"]
[null,null,"Apr_11","Apr_12",null,null,"Product 1"]
[null,null,"May_11","May_12",null,null,"Product 2"]
[null,null,"Jun_11","Jun_12",null,null,"Product 3"]
[null,null,"Jul_11","Jul_12",null,null,"Product 4"]
[null,null,"Aug_11","Aug_12",null,null,"Product 5"]
[null,null,"Sep_11","Sep_12",null,null,"Product 6"]
[null,null,"Oct_11","Oct_12",null,null,"Product 7"]
[null,null,"Nov_11","Nov_12",null,null,"Product 8"]
[null,null,"Dec_11","Dec_12",null,null,"Product 9"]
[null,null,null,null,null,null,"Product 10"]
[null,null,null,null,null,null,"Product 11"]
[null,null,null,null,null,null,"Product 12"]

{"sheet":"Dashboard","index":4,"n_rows":30,"n_cols":20,"rows_kept":30,"cut":false,"hidden":false,"merged":[[15,3,15,5],[15,0,15,2],[15,8,15,15],[29,16,31,19],[0,16,14,19],[15,16,15,19]]}
[null,null,null,null,null,null,null,null,null,null,null,null,null,null,null,null,{"$f":"Pivot!E21","v":"Person 4 Index of 99\n 2012 over 2011"}]
[]
[]
[]
[]
[]
[]
[]
[]
[]
[]
[]
[]
[]
[]
["By Region, By Product",null,null,"Choose month\n comparison",null,null,"Sep_11","Sep_12","Person comparison for each product - 2011 vs. 2012",null,null,null,null,null,null,null,"YoY Index for each person"]
[null,null,null,null,null,null,null,null,null,null,null,null,null,null,null,null,"SKU",2011,2012,"Rating"]
[null,null,null,null,null,null,null,null,null,null,null,null,null,null,null,null,{"$f":"Pivot!J18","v":"Product 1"},{"$f":"Pivot!K18","v":8214},{"$f":"Pivot!L18","v":8141},{"$f":"S18-R18","v":-73}]
[null,null,null,null,null,null,null,null,null,null,null,null,null,null,null,null,{"$f":"Pivot!J19","v":"Product 2"},{"$f":"Pivot!K19","v":8174},{"$f":"Pivot!L19","v":8189},{"$f":"S19-R19","v":15}]
[null,null,null,null,null,null,null,null,null,null,null,null,null,null,null,null,{"$f":"Pivot!J20","v":"Product 3"},{"$f":"Pivot!K20","v":8451},{"$f":"Pivot!L20","v":9106},655]
[null,null,null,null,null,null,null,null,null,null,null,null,null,null,null,null,{"$f":"Pivot!J21","v":"Product 4"},{"$f":"Pivot!K21","v":14309},{"$f":"Pivot!L21","v":13353},-956]
[null,null,null,null,null,null,null,null,null,null,null,null,null,null,null,null,{"$f":"Pivot!J22","v":"Product 5"},{"$f":"Pivot!K22","v":9491},{"$f":"Pivot!L22","v":8599},-892]
[null,null,null,null,null,null,null,null,null,null,null,null,null,null,null,null,{"$f":"Pivot!J23","v":"Product 6"},{"$f":"Pivot!K23","v":8376},{"$f":"Pivot!L23","v":8332},-44]
[null,null,null,null,null,null,null,null,null,null,null,null,null,null,null,null,{"$f":"Pivot!J24","v":"Product 7"},{"$f":"Pivot!K24","v":8320},{"$f":"Pivot!L24","v":7733},-587]
[null,null,null,null,null,null,null,null,null,null,null,null,null,null,null,null,{"$f":"Pivot!J25","v":"Product 8"},{"$f":"Pivot!K25","v":8584},{"$f":"Pivot!L25","v":8628},44]
[null,null,null,null,null,null,null,null,null,null,null,null,null,null,null,null,{"$f":"Pivot!J26","v":"Product 9"},{"$f":"Pivot!K26","v":13314},{"$f":"Pivot!L26","v":13712},398]
[null,null,null,null,null,null,null,null,null,null,null,null,null,null,null,null,{"$f":"Pivot!J27","v":"Product 10"},{"$f":"Pivot!K27","v":9035},{"$f":"Pivot!L27","v":9197},162]
[null,null,null,null,null,null,null,null,null,null,null,null,null,null,null,null,{"$f":"Pivot!J28","v":"Product 11"},{"$f":"Pivot!K28","v":8076},{"$f":"Pivot!L28","v":8554},478]
[null,null,null,null,null,null,null,null,null,null,null,null,null,null,null,null,{"$f":"Pivot!J29","v":"Product 12"},{"$f":"Pivot!K29","v":7807},{"$f":"Pivot!L29","v":8434},627]
[null,null,null,null,null,null,null,null,null,null,null,null,null,null,null,null,"YoY comparison for each Product by Customer"]