{"text_format":"1","workbook":"xlsx","n_sheets":8,"sheets":["Pivots","Region wise performance","Product wise performance","Customer wise performance","Sales Analysis","Sheet1","Sales Data","About Us"],"not_rendered":{"charts":8,"images":8,"macros":1,"external_links":0,"defined_names":1,"comments":0,"pivot_tables":2},"unopened":[],"bounds":{"document_bytes":16777216,"sheet_cells":100000,"rows_first":2000,"rows_last":500,"rows_between":2000,"halvings":0,"cell_chars":16384,"cell_head_chars":4096},"cells_cut":0,"cells_raw":0,"read":"whole","date_system":"1900"}

{"sheet":"Pivots","index":0,"n_rows":34,"n_cols":33,"rows_kept":34,"cut":false,"hidden":false,"merged":[]}
[]
[]
[null,"Values"]
["Region","Sum of Jan-11","Sum of Feb-11","Sum of Mar-11","Sum of Apr-11","Sum of May-11","Sum of Jun-11","Sum of Jul-11","Sum of Aug-11","Sum of Sep-11","Sum of Oct-11","Sum of Nov-11","Sum of Dec-11","Sum of Jan-12","Sum of Feb-12","Sum of Mar-12","Sum of Apr-12","Sum of May-12","Sum of Jun-12","Sum of Jul-12","Sum of Aug-12","Sum of Sep-12","Sum of Oct-12","Sum of Nov-12","Sum of Dec-12","Sum of F11Q1","Sum of F11Q2","Sum of F11Q3","Sum of F11Q4","Sum of F12Q1","Sum of F12Q2","Sum of F13Q3","Sum of F12Q4"]
["Region 1",28969,27186,28041,28908,28301,28796,28978,28052,28983,28248,27975,28628,28399,27972,29077,27988,27682,28565,27933,28431,28007,28820,28179,29167,84196,86005,86013,84851,85448,84235,84371,86166]
["Region 2",28162,27685,30114,29403,29831,28684,28025,28989,29173,28770,28749,29160,29229,28989,28591,29599,29930,28739,28906,27808,28449,28299,29445,29616,85961,87918,86187,86679,86809,88268,85163,87360]
["Region 3",27861,27788,27289,29818,28473,28702,28059,27973,28876,28612,29212,28222,28907,28999,29074,27813,28537,28457,28416,28738,28738,28358,27795,29563,82938,86993,84908,86046,86980,84807,85892,85716]
["Region 4",27551,29220,28456,28797,28465,27862,28324,29118,28218,28806,27909,28607,30137,28348,28562,29395,28061,28783,27956,28609,29664,28744,29461,29220,85227,85124,85660,85322,87047,86239,86229,87425]
[]
[]
[]
[]
[]
[]
[]
[]
[]
[]
[]
[]
[null,"Values"]
["Product","Sum of Jan-11","Sum of Feb-11","Sum of Mar-11","Sum of Apr-11","Sum of May-11","Sum of Jun-11","Sum of Jul-11","Sum of Aug-11","Sum of Sep-11","Sum of Oct-11","Sum of Nov-11","Sum of Dec-11","Sum of Jan-12","Sum of Feb-12","Sum of Mar-12","Sum of Apr-12","Sum of May-12","Sum of Jun-12","Sum of Jul-12","Sum of Aug-12","Sum of Sep-12","Sum of Oct-12","Sum of Nov-12","Sum of Dec-12"]
["Product 1",10010,9130,9572,9554,9932,9535,9884,9808,9701,9991,9962,10171,9716,9701,10221,9156,9173,9590,9443,9061,9138,9446,10123,9292]
["Product 2",9342,8924,9062,9834,9024,9766,9682,9386,9774,9210,8992,9396,9179,9338,9290,9049,9334,9288,9030,9536,9424,9619,8933,9463]
["Product 3",9617,9132,9407,9520,9345,9495,9412,8858,9508,9047,9021,9061,9504,8933,9566,9783,9175,9687,9460,9834,9445,9755,9123,10412]
["Product 4",9705,9604,10349,9673,9920,9808,9050,9638,9701,9879,9331,10113,10115,9630,9721,9613,9856,9742,9513,9696,9697,9744,10308,10537]
["Product 5",9782,9389,9805,9730,9828,9253,9680,9926,9616,9372,9764,8938,9326,9180,9560,9779,9716,9413,9454,8961,9210,9236,9523,9448]
["Product 6",8675,8692,9960,10000,10083,9623,9295,9425,9856,9519,9654,10109,9788,10179,9310,10207,10358,9584,9939,9151,9542,9319,9614,9631]
["Product 7",9022,9617,8640,9964,9746,8989,9381,9348,9517,9523,9789,9317,9882,9544,9520,9294,9008,9545,9069,9700,9992,9046,9225,9747]
["Product 8",9127,9230,9243,9896,9327,9541,8991,9293,9116,9561,9069,9519,9836,9384,9649,9395,9633,9123,9423,8907,9010,9483,9142,9255]
["Product 9",9712,8941,9406,9958,9400,10172,9687,9332,10243,9528,10354,9386,9189,10071,9905,9124,9896,9789,9924,10131,9736,9829,9428,10561]
["Product 10",9008,9724,9472,9416,9112,9375,9421,9775,9425,9373,9378,9335,10157,8968,9179,9783,9455,9601,9279,9652,10011,9103,10182,9985]
["Product 11",9313,10035,10082,9950,10237,9470,9915,10076,9362,10157,9311,10245,10120,9832,9940,9854,9525,9640,9803,9343,10094,10175,9840,9784]
["Product 12",9230,9461,8902,9431,9116,9017,8988,9267,9431,9276,9220,9027,9860,9548,9443,9758,9081,9542,8874,9614,9559,9466,9439,9451]

{"sheet":"Region wise performance","index":1,"n_rows":35,"n_cols":20,"rows_kept":35,"cut":false,"hidden":false,"merged":[]}
[]
[]
[]
[]
[]
[]
[]
[]
[null,null,null,null,null,null,"SP Name","Total Sales"]
[null,null,null,null,null,null,"Person 1",{"$f":"IF(Sheet1!$J$1=\"ALL\",SUMIF('Sales Data'!$D:$D,'Region wise performance'!$G10,'Sales Data'!$AC:$AC),SUMIFS('Sales Data'!$AC:$AC,'Sales Data'!$A:$A,Sheet1!$K$1,'Sales Data'!$D:$D,'Region wise performance'!$G10))","v":50275},{"$f":"IF(H10=MAX($H$10:$H$21),1,IF(H10=MIN($H$10:$H$21),0,\"\"))","v":""}]
[null,null,null,null,null,null,"Person 2",{"$f":"IF(Sheet1!$J$1=\"ALL\",SUMIF('Sales Data'!$D:$D,'Region wise performance'!$G11,'Sales Data'!$AC:$AC),SUMIFS('Sales Data'!$AC:$AC,'Sales Data'!$A:$A,Sheet1!$K$1,'Sales Data'!$D:$D,'Region wise performance'!$G11))","v":59901},{"$f":"IF(H11=MAX($H$10:$H$21),1,IF(H11=MIN($H$10:$H$21),0,\"\"))","v":""}]
[null,null,null,null,null,null,"Person 3",{"$f":"IF(Sheet1!$J$1=\"ALL\",SUMIF('Sales Data'!$D:$D,'Region wise performance'!$G12,'Sales Data'!$AC:$AC),SUMIFS('Sales Data'!$AC:$AC,'Sales Data'!$A:$A,Sheet1!$K$1,'Sales Data'!$D:$D,'Region wise performance'!$G12))","v":63143},1]
[null,null,null,null,null,null,"Person 4",{"$f":"IF(Sheet1!$J$1=\"ALL\",SUMIF('Sales Data'!$D:$D,'Region wise performance'!$G13,'Sales Data'!$AC:$AC),SUMIFS('Sales Data'!$AC:$AC,'Sales Data'!$A:$A,Sheet1!$K$1,'Sales Data'!$D:$D,'Region wise performance'!$G13))","v":50468},""]
[null,null,null,null,null,null,"Person 5",{"$f":"IF(Sheet1!$J$1=\"ALL\",SUMIF('Sales Data'!$D:$D,'Region wise performance'!$G14,'Sales Data'!$AC:$AC),SUMIFS('Sales Data'!$AC:$AC,'Sales Data'!$A:$A,Sheet1!$K$1,'Sales Data'!$D:$D,'Region wise performance'!$G14))","v":62454},""]
[null,null,null,null,null,null,"Person 6",{"$f":"IF(Sheet1!$J$1=\"ALL\",SUMIF('Sales Data'!$D:$D,'Region wise performance'!$G15,'Sales Data'!$AC:$AC),SUMIFS('Sales Data'!$AC:$AC,'Sales Data'!$A:$A,Sheet1!$K$1,'Sales Data'!$D:$D,'Region wise performance'!$G15))","v":49003},0]
[null,null,null,null,null,null,"Person 7",{"$f":"IF(Sheet1!$J$1=\"ALL\",SUMIF('Sales Data'!$D:$D,'Region wise performance'!$G16,'Sales Data'!$AC:$AC),SUMIFS('Sales Data'!$AC:$AC,'Sales Data'!$A:$A,Sheet1!$K$1,'Sales Data'!$D:$D,'Region wise performance'!$G16))","v":61755},""]
[null,null,null,null,null,null,"Person 8",{"$f":"IF(Sheet1!$J$1=\"ALL\",SUMIF('Sales Data'!$D:$D,'Region wise performance'!$G17,'Sales Data'!$AC:$AC),SUMIFS('Sales Data'!$AC:$AC,'Sales Data'!$A:$A,Sheet1!$K$1,'Sales Data'!$D:$D,'Region wise performance'!$G17))","v":59529},"",null,null,{"$f":"OFFSET('Sales Data'!$D$1,1,Sheet1!B$22)","v":"2011-04-01"},{"$f":"OFFSET('Sales Data'!$D$1,1,Sheet1!C$22)","v":"2011-05-01"},{"$f":"OFFSET('Sales Data'!$D$1,1,Sheet1!D$22)","v":"2011-06-01"},{"$f":"OFFSET('Sales Data'!$D$1,1,Sheet1!E$22)","v":"2011-07-01"},{"$f":"OFFSET('Sales Data'!$D$1,1,Sheet1!F$22)","v":"2011-08-01"},{"$f":"OFFSET('Sales Data'!$D$1,1,Sheet1!G$22)","v":"2011-09-01"},{"$f":"OFFSET('Sales Data'!$D$1,1,Sheet1!H$22)","v":"2011-10-01"},{"$f":"OFFSET('Sales Data'!$D$1,1,Sheet1!I$22)","v":"2011-11-01"},{"$f":"OFFSET('Sales Data'!$D$1,1,Sheet1!J$22)","v":"2011-12-01"}]
[null,null,null,null,null,null,"Person 9",{"$f":"IF(Sheet1!$J$1=\"ALL\",SUMIF('Sales Data'!$D:$D,'Region wise performance'!$G18,'Sales Data'!$AC:$AC),SUMIFS('Sales Data'!$AC:$AC,'Sales Data'!$A:$A,Sheet1!$K$1,'Sales Data'!$D:$D,'Region wise performance'!$G18))","v":51011},"",null,"Region 1",{"$f":"OFFSET(Pivots!$A$4,Sheet1!$A23,Sheet1!B$22)","v":28908},{"$f":"OFFSET(Pivots!$A$4,Sheet1!$A23,Sheet1!C$22)","v":28301},{"$f":"OFFSET(Pivots!$A$4,Sheet1!$A23,Sheet1!D$22)","v":28796},{"$f":"OFFSET(Pivots!$A$4,Sheet1!$A23,Sheet1!E$22)","v":28978},{"$f":"OFFSET(Pivots!$A$4,Sheet1!$A23,Sheet1!F$22)","v":28052},{"$f":"OFFSET(Pivots!$A$4,Sheet1!$A23,Sheet1!G$22)","v":28983},{"$f":"OFFSET(Pivots!$A$4,Sheet1!$A23,Sheet1!H$22)","v":28248},{"$f":"OFFSET(Pivots!$A$4,Sheet1!$A23,Sheet1!I$22)","v":27975},{"$f":"OFFSET(Pivots!$A$4,Sheet1!$A23,Sheet1!J$22)","v":28628}]
[null,null,null,null,null,null,"Person 10",{"$f":"IF(Sheet1!$J$1=\"ALL\",SUMIF('Sales Data'!$D:$D,'Region wise performance'!$G19,'Sales Data'!$AC:$AC),SUMIFS('Sales Data'!$AC:$AC,'Sales Data'!$A:$A,Sheet1!$K$1,'Sales Data'!$D:$D,'Region wise performance'!$G19))","v":61906},"",null,"Region 2",{"$f":"OFFSET(Pivots!$A$4,Sheet1!$A24,Sheet1!B$22)","v":29403},{"$f":"OFFSET(Pivots!$A$4,Sheet1!$A24,Sheet1!C$22)","v":29831},{"$f":"OFFSET(Pivots!$A$4,Sheet1!$A24,Sheet1!D$22)","v":28684},{"$f":"OFFSET(Pivots!$A$4,Sheet1!$A24,Sheet1!E$22)","v":28025},{"$f":"OFFSET(Pivots!$A$4,Sheet1!$A24,Sheet1!F$22)","v":28989},{"$f":"OFFSET(Pivots!$A$4,Sheet1!$A24,Sheet1!G$22)","v":29173},{"$f":"OFFSET(Pivots!$A$4,Sheet1!$A24,Sheet1!H$22)","v":28770},{"$f":"OFFSET(Pivots!$A$4,Sheet1!$A24,Sheet1!I$22)","v":28749},{"$f":"OFFSET(Pivots!$A$4,Sheet1!$A24,Sheet1!J$22)","v":29160}]
[null,null,null,null,null,null,"Person 11",{"$f":"IF(Sheet1!$J$1=\"ALL\",SUMIF('Sales Data'!$D:$D,'Region wise performance'!$G20,'Sales Data'!$AC:$AC),SUMIFS('Sales Data'!$AC:$AC,'Sales Data'!$A:$A,Sheet1!$K$1,'Sales Data'!$D:$D,'Region wise performance'!$G20))","v":51272},"",null,"Region 3",{"$f":"OFFSET(Pivots!$A$4,Sheet1!$A25,Sheet1!B$22)","v":29818},{"$f":"OFFSET(Pivots!$A$4,Sheet1!$A25,Sheet1!C$22)","v":28473},{"$f":"OFFSET(Pivots!$A$4,Sheet1!$A25,Sheet1!D$22)","v":28702},{"$f":"OFFSET(Pivots!$A$4,Sheet1!$A25,Sheet1!E$22)","v":28059},{"$f":"OFFSET(Pivots!$A$4,Sheet1!$A25,Sheet1!F$22)","v":27973},{"$f":"OFFSET(Pivots!$A$4,Sheet1!$A25,Sheet1!G$22)","v":28876},{"$f":"OFFSET(Pivots!$A$4,Sheet1!$A25,Sheet1!H$22)","v":28612},{"$f":"OFFSET(Pivots!$A$4,Sheet1!$A25,Sheet1!I$22)","v":29212},{"$f":"OFFSET(Pivots!$A$4,Sheet1!$A25,Sheet1!J$22)","v":28222}]
[null,null,null,null,null,null,"Person 12",{"$f":"IF(Sheet1!$J$1=\"ALL\",SUMIF('Sales Data'!$D:$D,'Region wise performance'!$G21,'Sales Data'!$AC:$AC),SUMIFS('Sales Data'!$AC:$AC,'Sales Data'!$A:$A,Sheet1!$K$1,'Sales Data'!$D:$D,'Region wise performance'!$G21))","v":60568},"",null,"Region 4",{"$f":"OFFSET(Pivots!$A$4,Sheet1!$A26,Sheet1!B$22)","v":28797},{"$f":"OFFSET(Pivots!$A$4,Sheet1!$A26,Sheet1!C$22)","v":28465},{"$f":"OFFSET(Pivots!$A$4,Sheet1!$A26,Sheet1!D$22)","v":27862},{"$f":"OFFSET(Pivots!$A$4,Sheet1!$A26,Sheet1!E$22)","v":28324},{"$f":"OFFSET(Pivots!$A$4,Sheet1!$A26,Sheet1!F$22)","v":29118},{"$f":"OFFSET(Pivots!$A$4,Sheet1!$A26,Sheet1!G$22)","v":28218},{"$f":"OFFSET(Pivots!$A$4,Sheet1!$A26,Sheet1!H$22)","v":28806},{"$f":"OFFSET(Pivots!$A$4,Sheet1!$A26,Sheet1!I$22)","v":27909},{"$f":"OFFSET(Pivots!$A$4,Sheet1!$A26,Sheet1!J$22)","v":28607}]
[]
[]
[null,null,null,null,null,null,null,null,null,null,null,null,null,null,null,null,{"$f":"OFFSET(Sheet1!$A$27,1,Sheet1!B27)","v":"FY11-Q2"},{"$f":"OFFSET(Sheet1!$A$27,1,Sheet1!C27)","v":"FY11-Q3"},{"$f":"OFFSET(Sheet1!$A$27,1,Sheet1!D27)","v":"FY11-Q4"},{"$f":"OFFSET(Sheet1!$A$27,1,Sheet1!E27)","v":"FY12-Q1"}]
[null,null,null,null,null,null,null,null,null,null,null,null,null,null,null,"Region 1",{"$f":"OFFSET(Pivots!$Y$4,Sheet1!$A23,Sheet1!B$27)","v":86005},{"$f":"OFFSET(Pivots!$Y$4,Sheet1!$A23,Sheet1!C$27)","v":86013},{"$f":"OFFSET(Pivots!$Y$4,Sheet1!$A23,Sheet1!D$27)","v":84851},{"$f":"OFFSET(Pivots!$Y$4,Sheet1!$A23,Sheet1!E$27)","v":85448}]
[null,null,null,null,null,null,null,null,null,null,null,null,null,null,null,"Region 2",{"$f":"OFFSET(Pivots!$Y$4,Sheet1!$A24,Sheet1!B$27)","v":87918},{"$f":"OFFSET(Pivots!$Y$4,Sheet1!$A24,Sheet1!C$27)","v":86187},{"$f":"OFFSET(Pivots!$Y$4,Sheet1!$A24,Sheet1!D$27)","v":86679},{"$f":"OFFSET(Pivots!$Y$4,Sheet1!$A24,Sheet1!E$27)","v":86809}]
[null,null,null,null,null,null,null,null,null,null,null,null,null,null,null,"Region 3",{"$f":"OFFSET(Pivots!$Y$4,Sheet1!$A25,Sheet1!B$27)","v":86993},{"$f":"OFFSET(Pivots!$Y$4,Sheet1!$A25,Sheet1!C$27)","v":84908},{"$f":"OFFSET(Pivots!$Y$4,Sheet1!$A25,Sheet1!D$27)","v":86046},{"$f":"OFFSET(Pivots!$Y$4,Sheet1!$A25,Sheet1!E$27)","v":86980}]
[null,null,null,null,null,null,null,null,null,null,null,null,null,null,null,"Region 4",{"$f":"OFFSET(Pivots!$Y$4,Sheet1!$A26,Sheet1!B$27)","v":85124},{"$f":"OFFSET(Pivots!$Y$4,Sheet1!$A26,Sheet1!C$27)","v":85660},{"$f":"OFFSET(Pivots!$Y$4,Sheet1!$A26,Sheet1!D$27)","v":85322},{"$f":"OFFSET(Pivots!$Y$4,Sheet1!$A26,Sheet1!E$27)","v":87047}]
[]
[]
[]
[]
[]
[]
[123]

{"sheet":"Product wise performance","index":2,"n_rows":35,"n_cols":16,"rows_kept":35,"cut":false,"hidden":false,"merged":[[20,13,20,15]]}
[]
[]
[]
[]
[]
[]
[]
[]
[null,null,null,null,null,null,"SP Name","Total Sales"]
[null,null,null,null,null,null,"Customer 1",{"$f":"IF(Sheet1!$C$2=\"ALL\",SUMIF('Sales Data'!$C:$C,'Product wise performance'!$G10,'Sales Data'!$AC:$AC),SUMIFS('Sales Data'!$AC:$AC,'Sales Data'!C:C,'Product wise performance'!$G10,'Sales Data'!B:B,Sheet1!$D$2))","v":16630},{"$f":"IF(H10=MAX($H$10:$H$21),1,IF(H10=MIN($H$10:$H$21),0,\"\"))","v":""}]
[null,null,null,null,null,null,"Customer 2",{"$f":"IF(Sheet1!$C$2=\"ALL\",SUMIF('Sales Data'!$C:$C,'Product wise performance'!$G11,'Sales Data'!$AC:$AC),SUMIFS('Sales Data'!$AC:$AC,'Sales Data'!C:C,'Product wise performance'!$G11,'Sales Data'!B:B,Sheet1!$D$2))","v":27357},{"$f":"IF(H11=MAX($H$10:$H$21),1,IF(H11=MIN($H$10:$H$21),0,\"\"))","v":1}]
[null,null,null,null,null,null,"Customer 3",{"$f":"IF(Sheet1!$C$2=\"ALL\",SUMIF('Sales Data'!$C:$C,'Product wise performance'!$G12,'Sales Data'!$AC:$AC),SUMIFS('Sales Data'!$AC:$AC,'Sales Data'!C:C,'Product wise performance'!$G12,'Sales Data'!B:B,Sheet1!$D$2))","v":16553},""]
[null,null,null,null,null,null,"Customer 4",{"$f":"IF(Sheet1!$C$2=\"ALL\",SUMIF('Sales Data'!$C:$C,'Product wise performance'!$G13,'Sales Data'!$AC:$AC),SUMIFS('Sales Data'!$AC:$AC,'Sales Data'!C:C,'Product wise performance'!$G13,'Sales Data'!B:B,Sheet1!$D$2))","v":17856},""]
[null,null,null,null,null,null,"Customer 5",{"$f":"IF(Sheet1!$C$2=\"ALL\",SUMIF('Sales Data'!$C:$C,'Product wise performance'!$G14,'Sales Data'!$AC:$AC),SUMIFS('Sales Data'!$AC:$AC,'Sales Data'!C:C,'Product wise performance'!$G14,'Sales Data'!B:B,Sheet1!$D$2))","v":17682},""]
[null,null,null,null,null,null,"Customer 6",{"$f":"IF(Sheet1!$C$2=\"ALL\",SUMIF('Sales Data'!$C:$C,'Product wise performance'!$G15,'Sales Data'!$AC:$AC),SUMIFS('Sales Data'!$AC:$AC,'Sales Data'!C:C,'Product wise performance'!$G15,'Sales Data'!B:B,Sheet1!$D$2))","v":16787},""]
[null,null,null,null,null,null,"Customer 7",{"$f":"IF(Sheet1!$C$2=\"ALL\",SUMIF('Sales Data'!$C:$C,'Product wise performance'!$G16,'Sales Data'!$AC:$AC),SUMIFS('Sales Data'!$AC:$AC,'Sales Data'!C:C,'Product wise performance'!$G16,'Sales Data'!B:B,Sheet1!$D$2))","v":26895},""]
[null,null,null,null,null,null,"Customer 8",{"$f":"IF(Sheet1!$C$2=\"ALL\",SUMIF('Sales Data'!$C:$C,'Product wise performance'!$G17,'Sales Data'!$AC:$AC),SUMIFS('Sales Data'!$AC:$AC,'Sales Data'!C:C,'Product wise performance'!$G17,'Sales Data'!B:B,Sheet1!$D$2))","v":15830},0]
[null,null,null,null,null,null,"Customer 9",{"$f":"IF(Sheet1!$C$2=\"ALL\",SUMIF('Sales Data'!$C:$C,'Product wise performance'!$G18,'Sales Data'!$AC:$AC),SUMIFS('Sales Data'!$AC:$AC,'Sales Data'!C:C,'Product wise performance'!$G18,'Sales Data'!B:B,Sheet1!$D$2))","v":18014},""]
[null,null,null,null,null,null,"Customer 10",{"$f":"IF(Sheet1!$C$2=\"ALL\",SUMIF('Sales Data'!$C:$C,'Product wise performance'!$G19,'Sales Data'!$AC:$AC),SUMIFS('Sales Data'!$AC:$AC,'Sales Data'!C:C,'Product wise performance'!$G19,'Sales Data'!B:B,Sheet1!$D$2))","v":18633},""]
[null,null,null,null,null,null,"Customer 11",{"$f":"IF(Sheet1!$C$2=\"ALL\",SUMIF('Sales Data'!$C:$C,'Product wise performance'!$G20,'Sales Data'!$AC:$AC),SUMIFS('Sales Data'!$AC:$AC,'Sales Data'!C:C,'Product wise performance'!$G20,'Sales Data'!B:B,Sheet1!$D$2))","v":17001},""]
[null,null,null,null,null,null,"Customer 12",{"$f":"IF(Sheet1!$C$2=\"ALL\",SUMIF('Sales Data'!$C:$C,'Product wise performance'!$G21,'Sales Data'!$AC:$AC),SUMIFS('Sales Data'!$AC:$AC,'Sales Data'!C:C,'Product wise performance'!$G21,'Sales Data'!B:B,Sheet1!$D$2))","v":26865},"",null,null,{"$f":"Sheet1!A2","v":"Product 2"},{"$f":"Sheet1!B2","v":"Product 9"},"Incr/Decr"]
[null,null,null,null,null,null,null,null,null,null,"Customer 1",{"$f":"SUMIFS('Sales Data'!$AC:$AC,'Sales Data'!$B:$B,'Product wise performance'!L$21,'Sales Data'!$C:$C,'Product wise performance'!$K22)","v":16363},{"$f":"SUMIFS('Sales Data'!$AC:$AC,'Sales Data'!$B:$B,'Product wise performance'!M$21,'Sales Data'!$C:$C,'Product wise performance'!$K22)","v":27026},{"$f":"IF(SUM($O$22:$O$33)=0,\"\",IF(O22=MAX($O$22:$O$33),1,IF(O22=MIN($O$22:$O$33),0,\"\")))","v":""},{"$f":"M22-L22","v":10663},{"$f":"IF(SUM($O$22:$O$33)=0,\"\",IF(L22<=M22,1,0))","v":1}]
[null,null,null,null,null,null,null,null,null,null,"Customer 2",{"$f":"SUMIFS('Sales Data'!$AC:$AC,'Sales Data'!$B:$B,'Product wise performance'!L$21,'Sales Data'!$C:$C,'Product wise performance'!$K23)","v":18052},{"$f":"SUMIFS('Sales Data'!$AC:$AC,'Sales Data'!$B:$B,'Product wise performance'!M$21,'Sales Data'!$C:$C,'Product wise performance'!$K23)","v":15706},{"$f":"IF(SUM($O$22:$O$33)=0,\"\",IF(O23=MAX($O$22:$O$33),1,IF(O23=MIN($O$22:$O$33),0,\"\")))","v":""},-2346,{"$f":"IF(SUM($O$22:$O$33)=0,\"\",IF(L23<=M23,1,0))","v":0}]
[null,null,null,null,null,null,null,null,null,null,"Customer 3",{"$f":"SUMIFS('Sales Data'!$AC:$AC,'Sales Data'!$B:$B,'Product wise performance'!L$21,'Sales Data'!$C:$C,'Product wise performance'!$K24)","v":19121},{"$f":"SUMIFS('Sales Data'!$AC:$AC,'Sales Data'!$B:$B,'Product wise performance'!M$21,'Sales Data'!$C:$C,'Product wise performance'!$K24)","v":18721},"",-400,0]
[null,null,null,null,null,null,null,null,null,null,"Customer 4",{"$f":"SUMIFS('Sales Data'!$AC:$AC,'Sales Data'!$B:$B,'Product wise performance'!L$21,'Sales Data'!$C:$C,'Product wise performance'!$K25)","v":16714},{"$f":"SUMIFS('Sales Data'!$AC:$AC,'Sales Data'!$B:$B,'Product wise performance'!M$21,'Sales Data'!$C:$C,'Product wise performance'!$K25)","v":18955},"",2241,1]
[null,null,null,null,null,null,null,null,null,null,"Customer 5",{"$f":"SUMIFS('Sales Data'!$AC:$AC,'Sales Data'!$B:$B,'Product wise performance'!L$21,'Sales Data'!$C:$C,'Product wise performance'!$K26)","v":26168},{"$f":"SUMIFS('Sales Data'!$AC:$AC,'Sales Data'!$B:$B,'Product wise performance'!M$21,'Sales Data'!$C:$C,'Product wise performance'!$K26)","v":16680},0,-9488,0]
[null,null,null,null,null,null,null,null,null,null,"Customer 6",{"$f":"SUMIFS('Sales Data'!$AC:$AC,'Sales Data'!$B:$B,'Product wise performance'!L$21,'Sales Data'!$C:$C,'Product wise performance'!$K27)","v":14837},{"$f":"SUMIFS('Sales Data'!$AC:$AC,'Sales Data'!$B:$B,'Product wise performance'!M$21,'Sales Data'!$C:$C,'Product wise performance'!$K27)","v":25225},"",10388,1]
[null,null,null,null,null,null,null,null,null,null,"Customer 7",{"$f":"SUMIFS('Sales Data'!$AC:$AC,'Sales Data'!$B:$B,'Product wise performance'!L$21,'Sales Data'!$C:$C,'Product wise performance'!$K28)","v":18621},{"$f":"SUMIFS('Sales Data'!$AC:$AC,'Sales Data'!$B:$B,'Product wise performance'!M$21,'Sales Data'!$C:$C,'Product wise performance'!$K28)","v":16180},"",-2441,0]
[null,null,null,null,null,null,null,null,null,null,"Customer 8",{"$f":"SUMIFS('Sales Data'!$AC:$AC,'Sales Data'!$B:$B,'Product wise performance'!L$21,'Sales Data'!$C:$C,'Product wise performance'!$K29)","v":18144},{"$f":"SUMIFS('Sales Data'!$AC:$AC,'Sales Data'!$B:$B,'Product wise performance'!M$21,'Sales Data'!$C:$C,'Product wise performance'!$K29)","v":17268},"",-876,0]
[null,null,null,null,null,null,null,null,null,null,"Customer 9",{"$f":"SUMIFS('Sales Data'!$AC:$AC,'Sales Data'!$B:$B,'Product wise performance'!L$21,'Sales Data'!$C:$C,'Product wise performance'!$K30)","v":16629},{"$f":"SUMIFS('Sales Data'!$AC:$AC,'Sales Data'!$B:$B,'Product wise performance'!M$21,'Sales Data'!$C:$C,'Product wise performance'!$K30)","v":17759},"",1130,1]
[null,null,null,null,null,null,null,null,null,null,"Customer 10",{"$f":"SUMIFS('Sales Data'!$AC:$AC,'Sales Data'!$B:$B,'Product wise performance'!L$21,'Sales Data'!$C:$C,'Product wise performance'!$K31)","v":25412},{"$f":"SUMIFS('Sales Data'!$AC:$AC,'Sales Data'!$B:$B,'Product wise performance'!M$21,'Sales Data'!$C:$C,'Product wise performance'!$K31)","v":16456},"",-8956,0]
[null,null,null,null,null,null,null,null,null,null,"Customer 11",{"$f":"SUMIFS('Sales Data'!$AC:$AC,'Sales Data'!$B:$B,'Product wise performance'!L$21,'Sales Data'!$C:$C,'Product wise performance'!$K32)","v":16127},{"$f":"SUMIFS('Sales Data'!$AC:$AC,'Sales Data'!$B:$B,'Product wise performance'!M$21,'Sales Data'!$C:$C,'Product wise performance'!$K32)","v":27772},1,11645,1]
[null,null,null,null,null,null,null,null,null,null,"Customer 12",{"$f":"SUMIFS('Sales Data'!$AC:$AC,'Sales Data'!$B:$B,'Product wise performance'!L$21,'Sales Data'!$C:$C,'Product wise performance'!$K33)","v":17687},{"$f":"SUMIFS('Sales Data'!$AC:$AC,'Sales Data'!$B:$B,'Product wise performance'!M$21,'Sales Data'!$C:$C,'Product wise performance'!$K33)","v":15954},"",-1733,0]
[]
[123]

{"sheet":"Customer wise performance","index":3,"n_rows":35,"n_cols":16,"rows_kept":35,"cut":false,"hidden":false,"merged":[[20,13,20,15]]}
[]
[]
[]
[]
[]
[]
[]
[]
[null,null,null,null,null,null,"SP Name","Total Sales"]
[null,null,null,null,null,null,"Product 1",{"$f":"IF(Sheet1!$N$2=\"ALL\",SUMIF('Sales Data'!$B:$B,'Customer wise performance'!$G10,'Sales Data'!$AC:$AC),SUMIFS('Sales Data'!$AC:$AC,'Sales Data'!$B:$B,'Customer wise performance'!$G10,'Sales Data'!C:C,Sheet1!$O$2))","v":18082},{"$f":"IF(H10=MAX($H$10:$H$21),1,IF(H10=MIN($H$10:$H$21),0,\"\"))","v":""}]
[null,null,null,null,null,null,"Product 2",{"$f":"IF(Sheet1!$N$2=\"ALL\",SUMIF('Sales Data'!$B:$B,'Customer wise performance'!$G11,'Sales Data'!$AC:$AC),SUMIFS('Sales Data'!$AC:$AC,'Sales Data'!$B:$B,'Customer wise performance'!$G11,'Sales Data'!C:C,Sheet1!$O$2))","v":16629},{"$f":"IF(H11=MAX($H$10:$H$21),1,IF(H11=MIN($H$10:$H$21),0,\"\"))","v":""}]
[null,null,null,null,null,null,"Product 3",{"$f":"IF(Sheet1!$N$2=\"ALL\",SUMIF('Sales Data'!$B:$B,'Customer wise performance'!$G12,'Sales Data'!$AC:$AC),SUMIFS('Sales Data'!$AC:$AC,'Sales Data'!$B:$B,'Customer wise performance'!$G12,'Sales Data'!C:C,Sheet1!$O$2))","v":16300},""]
[null,null,null,null,null,null,"Product 4",{"$f":"IF(Sheet1!$N$2=\"ALL\",SUMIF('Sales Data'!$B:$B,'Customer wise performance'!$G13,'Sales Data'!$AC:$AC),SUMIFS('Sales Data'!$AC:$AC,'Sales Data'!$B:$B,'Customer wise performance'!$G13,'Sales Data'!C:C,Sheet1!$O$2))","v":17525},""]
[null,null,null,null,null,null,"Product 5",{"$f":"IF(Sheet1!$N$2=\"ALL\",SUMIF('Sales Data'!$B:$B,'Customer wise performance'!$G14,'Sales Data'!$AC:$AC),SUMIFS('Sales Data'!$AC:$AC,'Sales Data'!$B:$B,'Customer wise performance'!$G14,'Sales Data'!C:C,Sheet1!$O$2))","v":25748},""]
[null,null,null,null,null,null,"Product 6",{"$f":"IF(Sheet1!$N$2=\"ALL\",SUMIF('Sales Data'!$B:$B,'Customer wise performance'!$G15,'Sales Data'!$AC:$AC),SUMIFS('Sales Data'!$AC:$AC,'Sales Data'!$B:$B,'Customer wise performance'!$G15,'Sales Data'!C:C,Sheet1!$O$2))","v":17215},""]
[null,null,null,null,null,null,"Product 7",{"$f":"IF(Sheet1!$N$2=\"ALL\",SUMIF('Sales Data'!$B:$B,'Customer wise performance'!$G16,'Sales Data'!$AC:$AC),SUMIFS('Sales Data'!$AC:$AC,'Sales Data'!$B:$B,'Customer wise performance'!$G16,'Sales Data'!C:C,Sheet1!$O$2))","v":16836},""]
[null,null,null,null,null,null,"Product 8",{"$f":"IF(Sheet1!$N$2=\"ALL\",SUMIF('Sales Data'!$B:$B,'Customer wise performance'!$G17,'Sales Data'!$AC:$AC),SUMIFS('Sales Data'!$AC:$AC,'Sales Data'!$B:$B,'Customer wise performance'!$G17,'Sales Data'!C:C,Sheet1!$O$2))","v":16288},0]
[null,null,null,null,null,null,"Product 9",{"$f":"IF(Sheet1!$N$2=\"ALL\",SUMIF('Sales Data'!$B:$B,'Customer wise performance'!$G18,'Sales Data'!$AC:$AC),SUMIFS('Sales Data'!$AC:$AC,'Sales Data'!$B:$B,'Customer wise performance'!$G18,'Sales Data'!C:C,Sheet1!$O$2))","v":17759},""]
[null,null,null,null,null,null,"Product 10",{"$f":"IF(Sheet1!$N$2=\"ALL\",SUMIF('Sales Data'!$B:$B,'Customer wise performance'!$G19,'Sales Data'!$AC:$AC),SUMIFS('Sales Data'!$AC:$AC,'Sales Data'!$B:$B,'Customer wise performance'!$G19,'Sales Data'!C:C,Sheet1!$O$2))","v":28357},1]
[null,null,null,null,null,null,"Product 11",{"$f":"IF(Sheet1!$N$2=\"ALL\",SUMIF('Sales Data'!$B:$B,'Customer wise performance'!$G20,'Sales Data'!$AC:$AC),SUMIFS('Sales Data'!$AC:$AC,'Sales Data'!$B:$B,'Customer wise performance'!$G20,'Sales Data'!C:C,Sheet1!$O$2))","v":18014},""]
[null,null,null,null,null,null,"Product 12",{"$f":"IF(Sheet1!$N$2=\"ALL\",SUMIF('Sales Data'!$B:$B,'Customer wise performance'!$G21,'Sales Data'!$AC:$AC),SUMIFS('Sales Data'!$AC:$AC,'Sales Data'!$B:$B,'Customer wise performance'!$G21,'Sales Data'!C:C,Sheet1!$O$2))","v":16551},"",null,null,{"$f":"Sheet1!L2","v":"Customer 10"},{"$f":"Sheet1!M2","v":"Customer 8"},"Incr/Decr"]
[null,null,null,null,null,null,null,null,null,null,"Product 1",{"$f":"SUMIFS('Sales Data'!$AC:$AC,'Sales Data'!$B:$B,'Customer wise performance'!$K22,'Sales Data'!$C:$C,'Customer wise performance'!L$21)","v":18402},{"$f":"SUMIFS('Sales Data'!$AC:$AC,'Sales Data'!$B:$B,'Customer wise performance'!$K22,'Sales Data'!$C:$C,'Customer wise performance'!M$21)","v":16029},{"$f":"IF(SUM($O$22:$O$33)=0,\"\",IF(O22=MAX($O$22:$O$33),1,IF(O22=MIN($O$22:$O$33),0,\"\")))","v":""},{"$f":"M22-L22","v":-2373},{"$f":"IF(SUM($O$22:$O$33)=0,\"\",IF(L22<=M22,1,0))","v":0}]
[null,null,null,null,null,null,null,null,null,null,"Product 2",{"$f":"SUMIFS('Sales Data'!$AC:$AC,'Sales Data'!$B:$B,'Customer wise performance'!$K23,'Sales Data'!$C:$C,'Customer wise performance'!L$21)","v":25412},{"$f":"SUMIFS('Sales Data'!$AC:$AC,'Sales Data'!$B:$B,'Customer wise performance'!$K23,'Sales Data'!$C:$C,'Customer wise performance'!M$21)","v":18144},{"$f":"IF(SUM($O$22:$O$33)=0,\"\",IF(O23=MAX($O$22:$O$33),1,IF(O23=MIN($O$22:$O$33),0,\"\")))","v":""},-7268,{"$f":"IF(SUM($O$22:$O$33)=0,\"\",IF(L23<=M23,1,0))","v":0}]
[null,null,null,null,null,null,null,null,null,null,"Product 3",{"$f":"SUMIFS('Sales Data'!$AC:$AC,'Sales Data'!$B:$B,'Customer wise performance'!$K24,'Sales Data'!$C:$C,'Customer wise performance'!L$21)","v":18092},{"$f":"SUMIFS('Sales Data'!$AC:$AC,'Sales Data'!$B:$B,'Customer wise performance'!$K24,'Sales Data'!$C:$C,'Customer wise performance'!M$21)","v":25356},1,7264,1]
[null,null,null,null,null,null,null,null,null,null,"Product 4",{"$f":"SUMIFS('Sales Data'!$AC:$AC,'Sales Data'!$B:$B,'Customer wise performance'!$K25,'Sales Data'!$C:$C,'Customer wise performance'!L$21)","v":16407},{"$f":"SUMIFS('Sales Data'!$AC:$AC,'Sales Data'!$B:$B,'Customer wise performance'!$K25,'Sales Data'!$C:$C,'Customer wise performance'!M$21)","v":17510},"",1103,1]
[null,null,null,null,null,null,null,null,null,null,"Product 5",{"$f":"SUMIFS('Sales Data'!$AC:$AC,'Sales Data'!$B:$B,'Customer wise performance'!$K26,'Sales Data'!$C:$C,'Customer wise performance'!L$21)","v":16195},{"$f":"SUMIFS('Sales Data'!$AC:$AC,'Sales Data'!$B:$B,'Customer wise performance'!$K26,'Sales Data'!$C:$C,'Customer wise performance'!M$21)","v":17352},"",1157,1]
[null,null,null,null,null,null,null,null,null,null,"Product 6",{"$f":"SUMIFS('Sales Data'!$AC:$AC,'Sales Data'!$B:$B,'Customer wise performance'!$K27,'Sales Data'!$C:$C,'Customer wise performance'!L$21)","v":18037},{"$f":"SUMIFS('Sales Data'!$AC:$AC,'Sales Data'!$B:$B,'Customer wise performance'!$K27,'Sales Data'!$C:$C,'Customer wise performance'!M$21)","v":15436},"",-2601,0]
[null,null,null,null,null,null,null,null,null,null,"Product 7",{"$f":"SUMIFS('Sales Data'!$AC:$AC,'Sales Data'!$B:$B,'Customer wise performance'!$K28,'Sales Data'!$C:$C,'Customer wise performance'!L$21)","v":27160},{"$f":"SUMIFS('Sales Data'!$AC:$AC,'Sales Data'!$B:$B,'Customer wise performance'!$K28,'Sales Data'!$C:$C,'Customer wise performance'!M$21)","v":17915},0,-9245,0]
[null,null,null,null,null,null,null,null,null,null,"Product 8",{"$f":"SUMIFS('Sales Data'!$AC:$AC,'Sales Data'!$B:$B,'Customer wise performance'!$K29,'Sales Data'!$C:$C,'Customer wise performance'!L$21)","v":18437},{"$f":"SUMIFS('Sales Data'!$AC:$AC,'Sales Data'!$B:$B,'Customer wise performance'!$K29,'Sales Data'!$C:$C,'Customer wise performance'!M$21)","v":25328},"",6891,1]
[null,null,null,null,null,null,null,null,null,null,"Product 9",{"$f":"SUMIFS('Sales Data'!$AC:$AC,'Sales Data'!$B:$B,'Customer wise performance'!$K30,'Sales Data'!$C:$C,'Customer wise performance'!L$21)","v":16456},{"$f":"SUMIFS('Sales Data'!$AC:$AC,'Sales Data'!$B:$B,'Customer wise performance'!$K30,'Sales Data'!$C:$C,'Customer wise performance'!M$21)","v":17268},"",812,1]
[null,null,null,null,null,null,null,null,null,null,"Product 10",{"$f":"SUMIFS('Sales Data'!$AC:$AC,'Sales Data'!$B:$B,'Customer wise performance'!$K31,'Sales Data'!$C:$C,'Customer wise performance'!L$21)","v":15823},{"$f":"SUMIFS('Sales Data'!$AC:$AC,'Sales Data'!$B:$B,'Customer wise performance'!$K31,'Sales Data'!$C:$C,'Customer wise performance'!M$21)","v":16814},"",991,1]
[null,null,null,null,null,null,null,null,null,null,"Product 11",{"$f":"SUMIFS('Sales Data'!$AC:$AC,'Sales Data'!$B:$B,'Customer wise performance'!$K32,'Sales Data'!$C:$C,'Customer wise performance'!L$21)","v":18633},{"$f":"SUMIFS('Sales Data'!$AC:$AC,'Sales Data'!$B:$B,'Customer wise performance'!$K32,'Sales Data'!$C:$C,'Customer wise performance'!M$21)","v":15830},"",-2803,0]
[null,null,null,null,null,null,null,null,null,null,"Product 12",{"$f":"SUMIFS('Sales Data'!$AC:$AC,'Sales Data'!$B:$B,'Customer wise performance'!$K33,'Sales Data'!$C:$C,'Customer wise performance'!L$21)","v":26077},{"$f":"SUMIFS('Sales Data'!$AC:$AC,'Sales Data'!$B:$B,'Customer wise performance'!$K33,'Sales Data'!$C:$C,'Customer wise performance'!M$21)","v":17816},"",-8261,0]
[]
[123]

{"sheet":"Sales Analysis","index":4,"n_rows":32,"n_cols":11,"rows_kept":32,"cut":false,"hidden":false,"merged":[]}
[]
[]
[]
[]
[]
[]
[]
[]
[]
[]
[]
[]
[]
[]
[]
[]
[]
[]
[]
[null,null,{"$f":"OFFSET('Sales Data'!$D$1,1,Sheet1!B30)","v":"2011-05-01"},{"$f":"OFFSET('Sales Data'!$D$1,1,Sheet1!C30)","v":"2011-06-01"},{"$f":"OFFSET('Sales Data'!$D$1,1,Sheet1!D30)","v":"2011-07-01"},{"$f":"OFFSET('Sales Data'!$D$1,1,Sheet1!E30)","v":"2011-08-01"},{"$f":"OFFSET('Sales Data'!$D$1,1,Sheet1!F30)","v":"2011-09-01"},{"$f":"OFFSET('Sales Data'!$D$1,1,Sheet1!G30)","v":"2011-10-01"},{"$f":"OFFSET('Sales Data'!$D$1,1,Sheet1!H30)","v":"2011-11-01"},{"$f":"OFFSET('Sales Data'!$D$1,1,Sheet1!I30)","v":"2011-12-01"},{"$f":"OFFSET('Sales Data'!$D$1,1,Sheet1!J30)","v":"2012-01-01"}]
[null,"Product 1",{"$f":"OFFSET(Pivots!$A$22,Sheet1!$A31,Sheet1!B$30)","v":9932},{"$f":"OFFSET(Pivots!$A$22,Sheet1!$A31,Sheet1!C$30)","v":9535},{"$f":"OFFSET(Pivots!$A$22,Sheet1!$A31,Sheet1!D$30)","v":9884},{"$f":"OFFSET(Pivots!$A$22,Sheet1!$A31,Sheet1!E$30)","v":9808},{"$f":"OFFSET(Pivots!$A$22,Sheet1!$A31,Sheet1!F$30)","v":9701},{"$f":"OFFSET(Pivots!$A$22,Sheet1!$A31,Sheet1!G$30)","v":9991},{"$f":"OFFSET(Pivots!$A$22,Sheet1!$A31,Sheet1!H$30)","v":9962},{"$f":"OFFSET(Pivots!$A$22,Sheet1!$A31,Sheet1!I$30)","v":10171},{"$f":"OFFSET(Pivots!$A$22,Sheet1!$A31,Sheet1!J$30)","v":9716}]
[null,"Product 2",{"$f":"OFFSET(Pivots!$A$22,Sheet1!$A32,Sheet1!B$30)","v":9024},{"$f":"OFFSET(Pivots!$A$22,Sheet1!$A32,Sheet1!C$30)","v":9766},{"$f":"OFFSET(Pivots!$A$22,Sheet1!$A32,Sheet1!D$30)","v":9682},{"$f":"OFFSET(Pivots!$A$22,Sheet1!$A32,Sheet1!E$30)","v":9386},{"$f":"OFFSET(Pivots!$A$22,Sheet1!$A32,Sheet1!F$30)","v":9774},{"$f":"OFFSET(Pivots!$A$22,Sheet1!$A32,Sheet1!G$30)","v":9210},{"$f":"OFFSET(Pivots!$A$22,Sheet1!$A32,Sheet1!H$30)","v":8992},{"$f":"OFFSET(Pivots!$A$22,Sheet1!$A32,Sheet1!I$30)","v":9396},{"$f":"OFFSET(Pivots!$A$22,Sheet1!$A32,Sheet1!J$30)","v":9179}]
[null,"Product 3",{"$f":"OFFSET(Pivots!$A$22,Sheet1!$A33,Sheet1!B$30)","v":9345},{"$f":"OFFSET(Pivots!$A$22,Sheet1!$A33,Sheet1!C$30)","v":9495},{"$f":"OFFSET(Pivots!$A$22,Sheet1!$A33,Sheet1!D$30)","v":9412},{"$f":"OFFSET(Pivots!$A$22,Sheet1!$A33,Sheet1!E$30)","v":8858},{"$f":"OFFSET(Pivots!$A$22,Sheet1!$A33,Sheet1!F$30)","v":9508},{"$f":"OFFSET(Pivots!$A$22,Sheet1!$A33,Sheet1!G$30)","v":9047},{"$f":"OFFSET(Pivots!$A$22,Sheet1!$A33,Sheet1!H$30)","v":9021},{"$f":"OFFSET(Pivots!$A$22,Sheet1!$A33,Sheet1!I$30)","v":9061},{"$f":"OFFSET(Pivots!$A$22,Sheet1!$A33,Sheet1!J$30)","v":9504}]
[null,"Product 4",{"$f":"OFFSET(Pivots!$A$22,Sheet1!$A34,Sheet1!B$30)","v":9920},{"$f":"OFFSET(Pivots!$A$22,Sheet1!$A34,Sheet1!C$30)","v":9808},{"$f":"OFFSET(Pivots!$A$22,Sheet1!$A34,Sheet1!D$30)","v":9050},{"$f":"OFFSET(Pivots!$A$22,Sheet1!$A34,Sheet1!E$30)","v":9638},{"$f":"OFFSET(Pivots!$A$22,Sheet1!$A34,Sheet1!F$30)","v":9701},{"$f":"OFFSET(Pivots!$A$22,Sheet1!$A34,Sheet1!G$30)","v":9879},{"$f":"OFFSET(Pivots!$A$22,Sheet1!$A34,Sheet1!H$30)","v":9331},{"$f":"OFFSET(Pivots!$A$22,Sheet1!$A34,Sheet1!I$30)","v":10113},{"$f":"OFFSET(Pivots!$A$22,Sheet1!$A34,Sheet1!J$30)","v":10115}]
[null,"Product 5",{"$f":"OFFSET(Pivots!$A$22,Sheet1!$A35,Sheet1!B$30)","v":9828},{"$f":"OFFSET(Pivots!$A$22,Sheet1!$A35,Sheet1!C$30)","v":9253},{"$f":"OFFSET(Pivots!$A$22,Sheet1!$A35,Sheet1!D$30)","v":9680},{"$f":"OFFSET(Pivots!$A$22,Sheet1!$A35,Sheet1!E$30)","v":9926},{"$f":"OFFSET(Pivots!$A$22,Sheet1!$A35,Sheet1!F$30)","v":9616},{"$f":"OFFSET(Pivots!$A$22,Sheet1!$A35,Sheet1!G$30)","v":9372},{"$f":"OFFSET(Pivots!$A$22,Sheet1!$A35,Sheet1!H$30)","v":9764},{"$f":"OFFSET(Pivots!$A$22,Sheet1!$A35,Sheet1!I$30)","v":8938},{"$f":"OFFSET(Pivots!$A$22,Sheet1!$A35,Sheet1!J$30)","v":9326}]
[null,"Product 6",{"$f":"OFFSET(Pivots!$A$22,Sheet1!$A36,Sheet1!B$30)","v":10083},{"$f":"OFFSET(Pivots!$A$22,Sheet1!$A36,Sheet1!C$30)","v":9623},{"$f":"OFFSET(Pivots!$A$22,Sheet1!$A36,Sheet1!D$30)","v":9295},{"$f":"OFFSET(Pivots!$A$22,Sheet1!$A36,Sheet1!E$30)","v":9425},{"$f":"OFFSET(Pivots!$A$22,Sheet1!$A36,Sheet1!F$30)","v":9856},{"$f":"OFFSET(Pivots!$A$22,Sheet1!$A36,Sheet1!G$30)","v":9519},{"$f":"OFFSET(Pivots!$A$22,Sheet1!$A36,Sheet1!H$30)","v":9654},{"$f":"OFFSET(Pivots!$A$22,Sheet1!$A36,Sheet1!I$30)","v":10109},{"$f":"OFFSET(Pivots!$A$22,Sheet1!$A36,Sheet1!J$30)","v":9788}]
[null,"Product 7",{"$f":"OFFSET(Pivots!$A$22,Sheet1!$A37,Sheet1!B$30)","v":9746},{"$f":"OFFSET(Pivots!$A$22,Sheet1!$A37,Sheet1!C$30)","v":8989},{"$f":"OFFSET(Pivots!$A$22,Sheet1!$A37,Sheet1!D$30)","v":9381},{"$f":"OFFSET(Pivots!$A$22,Sheet1!$A37,Sheet1!E$30)","v":9348},{"$f":"OFFSET(Pivots!$A$22,Sheet1!$A37,Sheet1!F$30)","v":9517},{"$f":"OFFSET(Pivots!$A$22,Sheet1!$A37,Sheet1!G$30)","v":9523},{"$f":"OFFSET(Pivots!$A$22,Sheet1!$A37,Sheet1!H$30)","v":9789},{"$f":"OFFSET(Pivots!$A$22,Sheet1!$A37,Sheet1!I$30)","v":9317},{"$f":"OFFSET(Pivots!$A$22,Sheet1!$A37,Sheet1!J$30)","v":9882}]
[null,"Product 8",{"$f":"OFFSET(Pivots!$A$22,Sheet1!$A38,Sheet1!B$30)","v":9327},{"$f":"OFFSET(Pivots!$A$22,Sheet1!$A38,Sheet1!C$30)","v":9541},{"$f":"OFFSET(Pivots!$A$22,Sheet1!$A38,Sheet1!D$30)","v":8991},{"$f":"OFFSET(Pivots!$A$22,Sheet1!$A38,Sheet1!E$30)","v":9293},{"$f":"OFFSET(Pivots!$A$22,Sheet1!$A38,Sheet1!F$30)","v":9116},{"$f":"OFFSET(Pivots!$A$22,Sheet1!$A38,Sheet1!G$30)","v":9561},{"$f":"OFFSET(Pivots!$A$22,Sheet1!$A38,Sheet1!H$30)","v":9069},{"$f":"OFFSET(Pivots!$A$22,Sheet1!$A38,Sheet1!I$30)","v":9519},{"$f":"OFFSET(Pivots!$A$22,Sheet1!$A38,Sheet1!J$30)","v":9836}]
[null,"Product 9",{"$f":"OFFSET(Pivots!$A$22,Sheet1!$A39,Sheet1!B$30)","v":9400},{"$f":"OFFSET(Pivots!$A$22,Sheet1!$A39,Sheet1!C$30)","v":10172},{"$f":"OFFSET(Pivots!$A$22,Sheet1!$A39,Sheet1!D$30)","v":9687},{"$f":"OFFSET(Pivots!$A$22,Sheet1!$A39,Sheet1!E$30)","v":9332},{"$f":"OFFSET(Pivots!$A$22,Sheet1!$A39,Sheet1!F$30)","v":10243},{"$f":"OFFSET(Pivots!$A$22,Sheet1!$A39,Sheet1!G$30)","v":9528},{"$f":"OFFSET(Pivots!$A$22,Sheet1!$A39,Sheet1!H$30)","v":10354},{"$f":"OFFSET(Pivots!$A$22,Sheet1!$A39,Sheet1!I$30)","v":9386},{"$f":"OFFSET(Pivots!$A$22,Sheet1!$A39,Sheet1!J$30)","v":9189}]
[null,"Product 10",{"$f":"OFFSET(Pivots!$A$22,Sheet1!$A40,Sheet1!B$30)","v":9112},{"$f":"OFFSET(Pivots!$A$22,Sheet1!$A40,Sheet1!C$30)","v":9375},{"$f":"OFFSET(Pivots!$A$22,Sheet1!$A40,Sheet1!D$30)","v":9421},{"$f":"OFFSET(Pivots!$A$22,Sheet1!$A40,Sheet1!E$30)","v":9775},{"$f":"OFFSET(Pivots!$A$22,Sheet1!$A40,Sheet1!F$30)","v":9425},{"$f":"OFFSET(Pivots!$A$22,Sheet1!$A40,Sheet1!G$30)","v":9373},{"$f":"OFFSET(Pivots!$A$22,Sheet1!$A40,Sheet1!H$30)","v":9378},{"$f":"OFFSET(Pivots!$A$22,Sheet1!$A40,Sheet1!I$30)","v":9335},{"$f":"OFFSET(Pivots!$A$22,Sheet1!$A40,Sheet1!J$30)","v":10157}]
[null,"Product 11",{"$f":"OFFSET(Pivots!$A$22,Sheet1!$A41,Sheet1!B$30)","v":10237},{"$f":"OFFSET(Pivots!$A$22,Sheet1!$A41,Sheet1!C$30)","v":9470},{"$f":"OFFSET(Pivots!$A$22,Sheet1!$A41,Sheet1!D$30)","v":9915},{"$f":"OFFSET(Pivots!$A$22,Sheet1!$A41,Sheet1!E$30)","v":10076},{"$f":"OFFSET(Pivots!$A$22,Sheet1!$A41,Sheet1!F$30)","v":9362},{"$f":"OFFSET(Pivots!$A$22,Sheet1!$A41,Sheet1!G$30)","v":10157},{"$f":"OFFSET(Pivots!$A$22,Sheet1!$A41,Sheet1!H$30)","v":9311},{"$f":"OFFSET(Pivots!$A$22,Sheet1!$A41,Sheet1!I$30)","v":10245},{"$f":"OFFSET(Pivots!$A$22,Sheet1!$A41,Sheet1!J$30)","v":10120}]
[null,"Product 12",{"$f":"OFFSET(Pivots!$A$22,Sheet1!$A42,Sheet1!B$30)","v":9116},{"$f":"OFFSET(Pivots!$A$22,Sheet1!$A42,Sheet1!C$30)","v":9017},{"$f":"OFFSET(Pivots!$A$22,Sheet1!$A42,Sheet1!D$30)","v":8988},{"$f":"OFFSET(Pivots!$A$22,Sheet1!$A42,Sheet1!E$30)","v":9267},{"$f":"OFFSET(Pivots!$A$22,Sheet1!$A42,Sheet1!F$30)","v":9431},{"$f":"OFFSET(Pivots!$A$22,Sheet1!$A42,Sheet1!G$30)","v":9276},{"$f":"OFFSET(Pivots!$A$22,Sheet1!$A42,Sheet1!H$30)","v":9220},{"$f":"OFFSET(Pivots!$A$22,Sheet1!$A42,Sheet1!I$30)","v":9027},{"$f":"OFFSET(Pivots!$A$22,Sheet1!$A42,Sheet1!J$30)","v":9860}]

{"sheet":"Sheet1","index":5,"n_rows":42,"n_cols":15,"rows_kept":42,"cut":false,"hidden":false,"merged":[]}
[null,null,null,null,null,null,null,{"$f":"IF(I1=\"ALL\",\"\",I1)","v":""},{"$f":"INDEX(J3:J7,I2)","v":"ALL"},{"$f":"INDEX(J3:J7,J2)","v":"Region 1"},{"$f":"IF(J1=\"ALL\",\"\",J1)","v":"Region 1"}]
[{"$f":"INDEX(C5:C16,A3)","v":"Product 2"},{"$f":"INDEX(C5:C16,B3)","v":"Product 9"},{"$f":"INDEX(C4:C16,C3)","v":"Product 11"},{"$f":"IF(C2=\"ALL\",\"\",C2)","v":"Product 11"},null,null,null,null,1,2,null,{"$f":"INDEX(N5:N16,L3)","v":"Customer 10"},{"$f":"INDEX(N5:N16,M3)","v":"Customer 8"},{"$f":"INDEX(N4:N16,N3)","v":"Customer 9"},{"$f":"IF(N2=\"ALL\",\"\",N2)","v":"Customer 9"}]
[2,9,12,null,null,null,null,null,null,"ALL",null,10,8,10]
[null,null,"ALL",null,null,null,null,null,null,"Region 1",null,null,null,"ALL"]
[null,null,"Product 1",null,null,null,null,null,null,"Region 2",null,null,null,"Customer 1"]
[null,null,"Product 2",null,null,null,null,null,null,"Region 3",null,null,null,"Customer 2"]
[null,null,"Product 3",null,null,null,null,null,null,"Region 4",null,null,null,"Customer 3"]
[null,null,"Product 4",null,null,null,null,null,null,null,null,null,null,"Customer 4"]
[null,null,"Product 5",null,null,null,null,null,null,null,null,null,null,"Customer 5"]
[null,null,"Product 6",null,null,null,null,null,null,null,null,null,null,"Customer 6"]
[null,null,"Product 7",null,null,null,null,null,null,null,null,null,null,"Customer 7"]
[null,null,"Product 8",null,null,null,null,null,null,null,null,null,null,"Customer 8"]
[null,null,"Product 9",null,null,null,null,null,null,null,null,null,null,"Customer 9"]
[null,null,"Product 10",null,null,null,null,null,null,null,null,null,null,"Customer 10"]
[null,null,"Product 11",null,null,null,null,null,null,null,null,null,null,"Customer 11"]
[null,null,"Product 12",null,null,null,null,null,null,null,null,null,null,"Customer 12"]
[]
[]
[]
[]
[]
[null,4,{"$f":"B22+1","v":5},{"$f":"C22+1","v":6},7,8,9,10,11,12]
[1]
[2]
[3]
[4]
[null,2,{"$f":"B27+1","v":3},{"$f":"C27+1","v":4},5,6]
[null,"FY11-Q1","FY11-Q2","FY11-Q3","FY11-Q4","FY12-Q1","FY12-Q2","FY12-Q3","FY12-Q4"]
[]
[null,5,{"$f":"B30+1","v":6},{"$f":"C30+1","v":7},8,9,10,11,12,13]
[1]
[{"$f":"A31+1","v":2}]
[{"$f":"A32+1","v":3}]
[4]
[5]
[6]
[7]
[8]
[9]
[10]
[11]
[12]

{"sheet":"Sales Data","index":6,"n_rows":146,"n_cols":29,"rows_kept":146,"cut":false,"hidden":false,"merged":[[0,4,0,27]]}
[null,null,null,null,"Sales"]
["Region","Product","Customer Type","Sales Person - Name","2011-01-01","2011-02-01","2011-03-01","2011-04-01","2011-05-01","2011-06-01","2011-07-01","2011-08-01","2011-09-01","2011-10-01","2011-11-01","2011-12-01","2012-01-01","2012-02-01","2012-03-01","2012-04-01","2012-05-01","2012-06-01","2012-07-01","2012-08-01","2012-09-01","2012-10-01","2012-11-01","2012-12-01","Total"]
["Region 1","Product 1","Customer 1","Person 1",717,641,654,752,595,769,793,710,564,677,619,723,639,757,746,758,562,563,782,559,640,669,774,692,{"$f":"SUM(E3:AB3)","v":16355}]
["Region 1","Product 1","Customer 2","Person 2",1400,1220,1114,899,1351,835,873,909,888,1278,1350,1348,931,1298,1164,800,903,958,836,909,853,918,1223,886,{"$f":"SUM(E4:AB4)","v":25144}]
["Region 1","Product 1","Customer 3","Person 3",696,643,644,596,645,649,612,675,794,591,709,561,733,771,792,577,586,727,678,753,652,689,767,643,16183]
["Region 1","Product 1","Customer 4","Person 4",732,628,628,667,819,640,850,755,612,644,622,881,854,766,713,784,667,711,733,677,637,815,756,693,17284]
["Region 1","Product 1","Customer 5","Person 5",607,602,636,869,847,806,895,835,843,799,834,785,744,858,799,677,867,605,828,620,655,704,784,635,18134]
["Region 1","Product 1","Customer 6","Person 6",800,607,737,621,660,733,743,666,630,644,617,695,653,648,788,731,710,745,788,756,627,669,731,650,16649]
["Region 1","Product 1","Customer 7","Person 7",1064,863,1316,1141,933,872,1185,1358,1173,1343,1164,1275,1364,828,1299,863,910,1146,915,941,1093,1224,938,946,26154]
["Region 1","Product 1","Customer 8","Person 8",667,609,780,559,673,727,730,550,787,609,762,604,555,747,640,649,565,725,602,594,799,721,786,589,16029]
["Region 1","Product 1","Customer 9","Person 9",890,751,645,807,845,820,832,771,724,696,657,899,693,705,749,758,774,652,801,815,649,638,615,896,18082]
["Region 1","Product 1","Customer 10","Person 10",711,624,804,885,873,628,666,648,879,779,782,605,830,775,895,707,826,719,845,615,839,779,822,866,18402]
["Region 1","Product 1","Customer 11","Person 11",651,788,748,703,701,692,771,738,646,608,786,737,603,604,632,680,729,756,795,772,663,768,735,683,16989]
["Region 1","Product 1","Customer 12","Person 12",1075,1154,866,1055,990,1364,934,1193,1161,1323,1060,1058,1117,944,1004,1172,1074,1283,840,1050,1031,852,1192,1113,25905]
["Region 1","Product 2","Customer 1","Person 1",580,682,641,761,759,787,595,654,763,591,639,722,745,685,678,641,600,690,766,783,662,592,636,711,16363]
["Region 1","Product 2","Customer 2","Person 2",756,790,609,886,656,620,668,786,755,738,742,655,793,647,653,856,687,744,874,795,881,806,772,883,18052]
["Region 1","Product 2","Customer 3","Person 3",779,659,813,800,859,844,714,764,881,693,739,753,860,872,833,833,835,870,863,896,775,867,617,702,19121]
["Region 1","Product 2","Customer 4","Person 4",658,681,756,717,621,766,780,712,765,620,651,619,682,696,749,757,735,654,729,755,677,610,700,624,16714]
["Region 1","Product 2","Customer 5","Person 5",1230,817,1030,1078,1093,1172,1323,1053,1121,1301,1103,1190,1248,1007,1003,908,830,1107,800,1117,1189,1352,1084,1012,26168]
["Region 1","Product 2","Customer 6","Person 6",727,586,583,673,706,610,645,556,560,646,658,592,630,576,657,574,586,600,625,568,597,698,588,596,14837]
["Region 1","Product 2","Customer 7","Person 7",642,778,843,881,726,850,827,759,721,618,757,899,632,853,824,833,880,787,760,726,637,669,844,875,18621]
["Region 1","Product 2","Customer 8","Person 8",888,697,861,701,748,779,850,744,720,613,651,870,651,871,870,725,691,848,689,847,615,706,755,754,18144]
["Region 1","Product 2","Customer 9","Person 9",605,749,605,729,600,795,695,680,606,782,765,774,767,705,740,627,696,615,693,626,625,712,710,728,16629]
["Region 1","Product 2","Customer 10","Person 10",1073,1161,905,1017,895,1224,1130,1314,1213,1254,942,903,870,1151,807,878,1325,804,905,1057,1193,1375,923,1093,25412]
["Region 1","Product 2","Customer 11","Person 11",689,688,737,759,581,608,576,704,789,617,743,684,617,554,638,611,614,697,721,691,771,570,704,764,16127]
["Region 1","Product 2","Customer 12","Person 12",715,636,679,832,780,711,879,660,880,737,602,735,684,721,838,806,855,872,605,675,802,662,600,721,17687]
["Region 1","Product 3","Customer 1","Person 1",637,646,671,714,744,786,784,697,636,654,760,722,889,631,744,834,670,853,830,827,650,696,631,851,17557]
["Region 1","Product 3","Customer 2","Person 2",692,716,645,726,681,601,733,627,783,614,602,705,756,746,623,682,780,672,679,624,751,727,779,761,16705]
["Region 1","Product 3","Customer 3","Person 3",1284,1302,1316,1210,823,1206,1253,1043,1223,1400,1094,881,1006,1045,1173,1102,1065,1363,1132,1212,1196,1189,962,1359,27839]
["Region 1","Product 3","Customer 4","Person 4",660,750,649,652,738,694,756,551,768,647,725,780,608,673,752,698,642,671,575,633,704,652,717,775,16470]
["Region 1","Product 3","Customer 5","Person 5",880,775,830,713,825,722,779,768,715,708,664,609,822,630,652,732,733,849,880,848,850,788,768,612,18152]
["Region 1","Product 3","Customer 6","Person 6",804,646,608,674,698,850,617,751,655,656,673,877,608,794,631,743,843,800,705,860,686,896,663,779,17517]
["Region 1","Product 3","Customer 7","Person 7",712,663,689,778,603,785,600,776,714,785,681,762,634,720,780,789,644,606,683,708,718,773,600,777,16980]
["Region 1","Product 3","Customer 8","Person 8",826,1022,1238,993,1219,1107,965,867,1205,872,892,944,1281,993,1254,1366,834,883,898,1255,1114,1137,900,1291,25356]
["Region 1","Product 3","Customer 9","Person 9",786,614,706,763,695,648,728,578,680,573,701,645,795,763,674,628,559,702,685,663,550,708,680,776,16300]
["Region 1","Product 3","Customer 10","Person 10",800,674,757,825,779,751,693,608,675,705,892,653,608,619,814,823,759,740,873,731,796,866,773,878,18092]
["Region 1","Product 3","Customer 11","Person 11",754,664,667,787,894,740,803,883,755,708,612,730,832,674,771,704,867,791,747,695,704,671,874,829,18156]
["Region 1","Product 3","Customer 12","Person 12",782,660,631,685,646,605,701,709,699,725,725,753,665,645,698,682,779,757,773,778,726,652,776,724,16976]
["Region 2","Product 4","Customer 1","Person 1",1194,1397,1397,1064,1211,1183,827,1088,1394,1076,1106,1372,1107,871,910,1305,1054,1122,1314,1360,801,1275,1316,918,27662]
["Region 2","Product 4","Customer 2","Person 2",733,607,647,786,719,775,567,620,577,671,689,762,609,780,753,590,696,695,581,739,564,598,634,689,16081]
["Region 2","Product 4","Customer 3","Person 3",666,815,820,862,847,752,657,620,869,848,848,886,831,712,632,883,786,821,631,615,712,870,785,794,18562]
["Region 2","Product 4","Customer 4","Person 4",746,702,886,608,748,652,755,807,607,810,778,684,756,759,673,638,795,785,601,755,699,715,618,829,17406]
["Region 2","Product 4","Customer 5","Person 5",753,690,646,653,795,736,667,668,733,674,620,778,757,738,661,721,639,601,732,621,668,764,742,761,16818]
["Region 2","Product 4","Customer 6","Person 6",1271,1188,1090,856,840,1217,933,1296,976,971,869,896,1323,1247,1081,985,1091,951,1175,1299,1254,857,1360,1386,26412]
["Region 2","Product 4","Customer 7","Person 7",797,641,785,621,709,657,570,565,560,759,573,741,728,717,689,634,756,563,626,748,792,673,679,787,16370]
["Region 2","Product 4","Customer 8","Person 8",686,637,731,863,821,678,833,840,748,838,618,822,625,820,865,616,606,793,626,726,664,603,794,657,17510]
["Region 2","Product 4","Customer 9","Person 9",618,782,753,691,642,833,633,829,656,758,626,874,778,884,739,833,665,766,614,619,843,614,600,875,17525]
["Region 2","Product 4","Customer 10","Person 10",737,604,749,669,740,724,600,671,603,624,700,693,631,701,693,792,672,691,698,683,643,668,719,702,16407]
["Region 2","Product 4","Customer 11","Person 11",849,989,1062,1241,1193,847,1212,1000,1378,1198,1319,898,1203,800,1341,861,1383,1198,1186,921,1358,1352,1376,1387,27552]
["Region 2","Product 4","Customer 12","Person 12",655,552,783,759,655,754,796,634,600,652,585,707,767,601,684,755,713,756,729,610,699,755,685,752,16638]
["Region 2","Product 5","Customer 1","Person 1",828,752,854,899,822,701,826,833,724,612,872,768,797,699,645,835,765,610,685,608,674,613,847,821,18090]
["Region 2","Product 5","Customer 2","Person 2",701,880,768,803,629,688,764,814,832,883,721,879,674,727,633,733,746,682,839,610,753,847,641,745,17992]
["Region 2","Product 5","Customer 3","Person 3",636,608,662,734,766,627,673,761,785,685,769,705,678,644,726,793,786,693,713,701,650,637,770,608,16810]
["Region 2","Product 5","Customer 4","Person 4",854,1079,1313,1214,1393,1176,1272,1288,829,1277,1165,856,953,1070,1297,1261,1037,1179,1147,838,1038,895,804,1025,26260]
["Region 2","Product 5","Customer 5","Person 5",678,599,569,766,664,650,763,662,733,718,726,585,568,612,603,716,623,782,725,753,774,672,570,732,16243]
["Region 2","Product 5","Customer 6","Person 6",848,755,642,600,749,742,667,642,601,831,792,743,605,834,884,795,728,791,641,832,696,684,810,692,17604]
["Region 2","Product 5","Customer 7","Person 7",739,850,712,733,873,638,850,900,725,735,824,735,811,870,793,712,771,881,894,651,684,674,763,878,18696]
["Region 2","Product 5","Customer 8","Person 8",799,763,771,671,763,675,735,798,744,627,730,677,783,661,769,630,778,642,662,799,690,727,794,664,17352]
["Region 2","Product 5","Customer 9","Person 9",1253,1047,1370,1061,974,853,927,1030,1163,890,1057,1025,1084,895,951,1186,1084,931,1064,997,1070,1265,1294,1277,25748]
["Region 2","Product 5","Customer 10","Person 10",798,727,572,608,602,800,688,617,800,658,675,618,717,635,566,618,697,761,552,760,609,686,733,698,16195]
["Region 2","Product 5","Customer 11","Person 11",794,698,694,834,760,817,807,706,801,775,760,610,781,635,816,757,841,660,819,794,899,657,827,665,18207]
["Region 2","Product 5","Customer 12","Person 12",854,631,878,807,833,886,708,875,879,681,673,737,875,898,877,743,860,801,713,618,673,879,670,643,18692]
["Region 2","Product 6","Customer 1","Person 1",778,663,675,714,785,625,604,642,731,646,715,798,734,664,784,656,783,732,607,667,707,629,626,743,16708]
["Region 2","Product 6","Customer 2","Person 2",1017,884,1098,1292,927,889,974,919,1393,1027,999,1230,1245,1284,1061,1192,1387,1256,1076,1188,821,1063,1088,937,26247]
["Region 2","Product 6","Customer 3","Person 3",708,715,723,711,774,653,557,779,586,744,590,793,656,585,601,788,618,611,793,679,689,640,645,596,16234]
["Region 2","Product 6","Customer 4","Person 4",654,738,647,799,620,897,625,839,653,651,871,788,642,809,795,825,894,615,622,646,766,753,674,722,17545]
["Region 2","Product 6","Customer 5","Person 5",617,798,891,674,605,844,804,857,836,648,640,776,711,849,759,758,744,775,799,649,830,707,858,855,18284]
["Region 2","Product 6","Customer 6","Person 6",707,603,687,671,628,764,799,623,740,640,609,702,624,633,687,716,711,611,760,752,655,614,762,770,{"$f":"SUM(E68:AB68)","v":16468}]
["Region 2","Product 6","Customer 7","Person 7",845,900,1044,982,1390,810,973,802,1320,1185,1175,907,1218,1089,942,1276,1388,1171,1277,897,1130,812,1280,1307,26120]
["Region 2","Product 6","Customer 8","Person 8",647,558,571,578,794,759,652,704,616,574,787,581,551,794,605,566,646,760,573,640,592,695,554,639,15436]
["Region 2","Product 6","Customer 9","Person 9",622,743,803,851,749,810,797,700,718,784,606,601,787,645,665,624,731,683,713,626,728,854,740,635,17215]
["Region 2","Product 6","Customer 10","Person 10",601,608,782,844,688,666,777,699,751,762,706,878,736,744,822,881,694,761,757,744,806,782,820,728,18037]
["Region 2","Product 6","Customer 11","Person 11",674,674,748,650,762,665,638,710,664,753,624,791,604,776,715,647,625,681,610,607,705,638,647,685,16293]
["Region 2","Product 6","Customer 12","Person 12",805,808,1291,1234,1361,1241,1095,1151,848,1105,1332,1264,1280,1307,874,1278,1137,928,1352,1056,1113,1132,920,1014,26926]
["Region 3","Product 7","Customer 1","Person 1",589,749,694,739,752,723,667,723,557,671,754,702,591,571,722,678,715,780,637,597,579,572,568,723,16053]
["Region 3","Product 7","Customer 2","Person 2",766,779,632,885,607,737,611,817,738,795,670,646,875,746,675,842,865,841,697,633,682,844,863,897,18143]
["Region 3","Product 7","Customer 3","Person 3",887,876,616,862,876,623,750,745,784,804,849,623,889,652,784,874,767,884,694,647,832,745,644,610,18317]
["Region 3","Product 7","Customer 4","Person 4",635,741,692,646,626,605,672,693,667,718,709,716,738,649,770,760,656,618,660,789,784,617,797,632,16590]
["Region 3","Product 7","Customer 5","Person 5",916,1331,814,1060,1097,949,1173,830,1153,1345,1085,1106,1055,1399,1100,1195,1122,1340,905,1369,1312,981,1229,1398,27264]
["Region 3","Product 7","Customer 6","Person 6",694,705,666,661,710,657,649,655,643,570,670,697,664,620,563,572,580,628,789,699,778,697,563,599,15729]
["Region 3","Product 7","Customer 7","Person 7",805,859,755,871,889,758,652,800,804,890,828,741,831,688,821,617,687,604,896,831,832,802,774,861,18896]
["Region 3","Product 7","Customer 8","Person 8",670,622,810,726,827,780,622,897,603,639,786,868,884,667,839,725,685,663,616,847,885,762,806,686,17915]
["Region 3","Product 7","Customer 9","Person 9",680,799,641,796,641,657,715,759,753,612,775,764,685,769,754,674,759,671,643,676,624,684,641,664,16836]
["Region 3","Product 7","Customer 10","Person 10",875,944,866,1224,1184,1149,1386,1120,1375,1185,1188,1003,1322,1175,1140,1002,892,1149,1204,1216,1312,957,1104,1188,27160]
["Region 3","Product 7","Customer 11","Person 11",749,609,788,755,763,645,606,651,660,630,775,795,664,714,667,642,654,676,552,595,644,785,633,800,16452]
["Region 3","Product 7","Customer 12","Person 12",756,603,666,739,774,706,878,658,780,664,700,656,684,894,685,713,626,691,776,801,728,600,603,689,17070]
["Region 3","Product 8","Customer 1","Person 1",657,775,756,642,840,734,703,711,617,683,760,706,748,687,639,764,802,748,775,624,815,647,692,687,17212]
["Region 3","Product 8","Customer 2","Person 2",631,643,767,774,742,711,673,742,717,779,647,657,607,762,797,670,661,789,615,748,630,764,782,623,16931]
["Region 3","Product 8","Customer 3","Person 3",1156,1230,858,1239,1009,1191,1043,1051,971,874,1135,1246,1049,1143,1369,1317,835,990,1002,992,900,1154,1120,1361,26235]
["Region 3","Product 8","Customer 4","Person 4",681,610,753,709,689,723,566,673,796,720,728,765,789,765,723,746,767,673,662,577,571,787,712,800,16985]
["Region 3","Product 8","Customer 5","Person 5",693,684,887,827,836,885,743,767,868,655,900,643,777,714,714,671,666,798,731,655,731,827,751,653,18076]
["Region 3","Product 8","Customer 6","Person 6",693,659,792,899,758,748,733,674,689,859,642,682,875,754,857,897,839,818,617,815,756,794,682,899,18431]
["Region 3","Product 8","Customer 7","Person 7",673,744,669,660,650,635,724,644,667,687,707,617,655,655,646,612,722,619,736,636,617,638,718,761,16092]
["Region 3","Product 8","Customer 8","Person 8",1189,924,875,1162,822,924,1207,1108,875,1363,825,1342,1238,887,1185,859,1375,922,1309,1076,941,1100,939,881,25328]
["Region 3","Product 8","Customer 9","Person 9",776,768,581,702,713,763,568,614,675,661,704,604,791,648,650,732,749,590,759,777,647,589,668,559,16288]
["Region 3","Product 8","Customer 10","Person 10",680,862,810,794,818,752,663,769,855,894,697,853,881,899,716,875,651,606,686,641,862,734,642,797,18437]
["Region 3","Product 8","Customer 11","Person 11",632,606,731,692,724,848,661,858,772,655,661,715,724,762,685,608,864,857,900,628,858,678,711,604,17434]
["Region 3","Product 8","Customer 12","Person 12",666,725,764,796,726,627,707,682,614,731,663,689,702,708,668,644,702,713,631,738,682,771,725,630,16704]
["Region 3","Product 9","Customer 1","Person 1",1098,802,1077,1150,839,1364,1057,960,1385,1004,1356,1222,833,1379,1184,980,1137,1310,889,1275,1275,983,1190,1277,27026]
["Region 3","Product 9","Customer 2","Person 2",740,556,672,650,606,558,769,662,613,554,718,579,612,682,780,559,796,578,630,709,695,654,698,636,15706]
["Region 3","Product 9","Customer 3","Person 3",772,896,827,868,883,807,673,693,635,710,836,796,837,898,808,760,635,881,668,877,736,646,743,836,18721]
["Region 3","Product 9","Customer 4","Person 4",829,814,879,898,755,793,667,835,896,830,789,714,848,727,887,833,724,736,798,618,716,880,624,865,18955]
["Region 3","Product 9","Customer 5","Person 5",755,635,727,621,643,706,669,726,744,767,713,647,659,774,602,697,758,622,623,730,781,677,633,771,16680]
["Region 3","Product 9","Customer 6","Person 6",991,879,810,1277,1074,1010,1287,883,1260,887,1327,1018,1021,807,1240,832,1214,993,1334,1084,901,881,819,1396,25225]
["Region 3","Product 9","Customer 7","Person 7",648,681,677,602,769,715,571,588,669,695,605,766,623,774,759,677,670,585,680,741,551,765,609,760,16180]
["Region 3","Product 9","Customer 8","Person 8",856,662,742,799,636,865,621,653,731,756,708,614,728,807,633,841,767,637,696,633,706,687,754,736,17268]
["Region 3","Product 9","Customer 9","Person 9",750,735,716,883,635,798,779,612,695,659,640,630,641,761,624,605,651,883,870,890,803,888,773,838,17759]
["Region 3","Product 9","Customer 10","Person 10",615,786,686,603,725,667,658,646,643,636,681,649,774,638,786,641,766,778,646,649,646,717,632,788,16456]
["Region 3","Product 9","Customer 11","Person 11",907,935,1026,1002,1248,1339,1183,1337,1189,1393,1337,1064,904,1076,834,1142,1169,1115,1354,1316,1268,1283,1393,958,27772]
["Region 3","Product 9","Customer 12","Person 12",751,560,567,605,587,550,753,737,783,637,644,687,709,748,768,557,609,671,736,609,658,768,560,700,15954]
["Region 4","Product 10","Customer 1","Person 1",697,725,800,658,819,761,661,700,819,796,894,705,893,672,663,854,847,624,823,736,725,824,659,877,18232]
["Region 4","Product 10","Customer 2","Person 2",733,808,765,898,611,816,848,615,628,717,891,762,884,654,800,875,690,751,693,874,860,769,702,767,18411]
["Region 4","Product 10","Customer 3","Person 3",645,799,669,749,688,800,669,686,624,666,636,729,675,789,754,722,621,799,625,651,771,711,721,651,16850]
["Region 4","Product 10","Customer 4","Person 4",844,1170,1292,1009,1103,919,1377,1352,1277,899,1131,827,1375,882,812,1274,1172,1170,879,1274,1208,943,1187,1253,26629]
["Region 4","Product 10","Customer 5","Person 5",675,649,717,641,610,715,661,764,703,614,561,694,738,703,728,565,737,706,699,788,736,791,762,696,16653]
["Region 4","Product 10","Customer 6","Person 6",661,804,658,603,631,639,635,662,627,679,709,844,766,819,832,603,645,657,688,750,758,650,899,793,17012]
["Region 4","Product 10","Customer 7","Person 7",618,672,876,900,799,742,624,898,623,883,679,617,766,684,768,669,749,874,805,747,789,781,768,778,18109]
["Region 4","Product 10","Customer 8","Person 8",619,686,692,771,672,675,769,640,721,641,678,698,781,648,665,748,743,653,770,640,730,789,768,617,16814]
["Region 4","Product 10","Customer 9","Person 9",1363,1185,1078,1197,897,1218,1070,1145,1290,1299,1154,1375,1034,1215,999,1392,1248,1284,1084,1036,1248,986,1399,1161,28357]
["Region 4","Product 10","Customer 10","Person 10",638,736,607,652,694,607,670,652,774,552,755,622,665,559,583,736,599,714,756,566,693,621,575,797,15823]
["Region 4","Product 10","Customer 11","Person 11",616,778,650,655,737,786,745,865,604,886,639,611,770,684,714,603,724,705,751,874,891,604,890,742,17524]
["Region 4","Product 10","Customer 12","Person 12",899,712,668,683,851,697,692,796,735,741,651,851,810,659,861,742,680,664,706,716,602,634,852,853,17755]
["Region 4","Product 11","Customer 1","Person 1",671,721,658,729,627,632,693,650,778,649,602,666,787,760,761,755,717,602,746,701,754,640,638,693,16630]
["Region 4","Product 11","Customer 2","Person 2",1232,1311,1225,1087,1128,1320,943,1289,1186,1328,928,1345,1167,812,801,1374,949,980,1108,1058,1175,1201,1034,1376,27357]
["Region 4","Product 11","Customer 3","Person 3",788,586,639,789,778,632,774,681,614,635,561,581,659,737,745,564,749,764,793,684,789,718,551,742,16553]
["Region 4","Product 11","Customer 4","Person 4",617,783,802,757,888,738,840,691,653,809,611,671,616,798,768,657,758,776,896,680,702,842,897,606,17856]
["Region 4","Product 11","Customer 5","Person 5",630,769,882,600,764,646,900,797,708,857,789,862,772,665,633,779,796,615,723,649,888,692,631,635,17682]
["Region 4","Product 11","Customer 6","Person 6",631,796,639,606,759,781,744,692,682,620,746,696,636,695,614,783,630,629,703,795,714,769,795,632,16787]
["Region 4","Product 11","Customer 7","Person 7",1079,1033,931,1336,1208,1345,903,1330,976,1104,968,901,1237,1252,1390,885,1228,998,888,995,1189,1328,1131,1260,26895]
["Region 4","Product 11","Customer 8","Person 8",782,638,762,710,749,643,622,660,586,568,777,688,638,712,583,578,575,726,603,575,634,579,696,746,15830]
["Region 4","Product 11","Customer 9","Person 9",627,839,729,701,691,646,804,663,861,793,706,820,845,884,736,853,621,887,759,709,817,702,637,684,18014]
["Region 4","Product 11","Customer 10","Person 10",625,706,782,896,670,631,847,898,628,854,617,900,890,704,814,720,900,814,811,797,837,858,728,706,{"$f":"SUM(E132:AB132)","v":18633}]
["Region 4","Product 11","Customer 11","Person 11",681,793,757,666,737,654,638,610,647,770,770,797,669,601,745,630,663,768,767,719,748,726,770,675,17001]
["Region 4","Product 11","Customer 12","Person 12",950,1060,1276,1073,1238,802,1207,1115,1043,1170,1236,1318,1204,1212,1350,1276,939,1081,1006,981,847,1120,1332,1029,26865]
["Region 4","Product 12","Customer 1","Person 1",620,562,647,598,643,598,695,636,781,566,734,727,800,780,739,685,555,644,769,759,688,657,651,707,16241]
["Region 4","Product 12","Customer 2","Person 2",856,724,765,883,892,761,857,796,613,723,716,842,802,616,839,661,834,698,625,655,624,659,775,689,17905]
["Region 4","Product 12","Customer 3","Person 3",662,794,893,667,605,812,604,880,898,788,886,755,609,848,602,857,686,673,655,750,752,794,734,661,17865]
["Region 4","Product 12","Customer 4","Person 4",719,787,609,634,700,725,759,640,745,615,773,638,709,764,644,761,614,752,761,720,781,692,705,676,16923]
["Region 4","Product 12","Customer 5","Person 5",1239,1385,823,1069,1336,857,869,901,812,1352,1084,1081,1323,1261,1334,1372,949,1165,962,1211,1304,956,1214,1097,26956]
["Region 4","Product 12","Customer 6","Person 6",665,781,580,798,618,685,571,672,730,588,610,568,712,746,602,599,661,587,586,693,622,681,614,706,15675]
["Region 4","Product 12","Customer 7","Person 7",688,716,797,618,628,745,731,773,724,741,656,611,750,755,890,776,726,849,627,679,781,875,803,898,17837]
["Region 4","Product 12","Customer 8","Person 8",833,736,643,887,725,702,653,682,753,712,800,668,856,666,692,770,672,896,674,817,898,769,674,638,17816]
["Region 4","Product 12","Customer 9","Person 9",749,683,739,714,742,767,676,670,629,683,625,616,646,625,717,604,758,604,715,647,753,704,764,721,16551]
["Region 4","Product 12","Customer 10","Person 10",819,870,817,1178,917,941,1017,1118,1316,1035,1045,1026,1348,1302,1119,1181,1210,1157,902,1311,1097,1199,1034,1118,26077]
["Region 4","Product 12","Customer 11","Person 11",653,727,768,756,595,577,796,740,551,776,601,651,637,561,608,658,621,787,702,582,611,698,694,695,16045]
["Region 4","Product 12","Customer 12","Person 12",727,696,821,629,715,847,760,759,879,697,690,844,668,624,657,834,795,730,896,790,648,782,777,845,18110]

{"sheet":"About Us","index":7,"n_rows":22,"n_cols":7,"rows_kept":22,"cut":false,"hidden":false,"merged":[]}
[]
[]
[]
[]
[]
[]
[]
[null,null,null,null,null,null,"Name: Raghuma Reddy"]
[null,null,null,null,null,null,"Current Employee at MARKETELLIGENT"]
[null,null,null,null,null,null,"Working in DELL through MARKETELLIGENT"]
[]
[null,null,null,null,null,null,"Location: Bangalore,  India"]
[null,null,null,null,null,null,"Mobile: +91 7411113351"]
[null,null,null,null,null,null,"Personal Email: raghumareddy99@gmail.com"]
[null,null,null,null,null,null,"Professional Email: raghuma.reddy@marketelligent.com"]
[]
[]
[]
[null,null,null,null,null,null,"FEEDBACK REQUEST: Please don't forget to send the feedback to my email."]
[]
[]
[null,null,null,null,null,null,"Great thanks for your valuable time spent on this dashboard."]